HResults HResults HResults Class

Definition

Contains all event messages and HRESULTs for the Integration Services runtime, pipeline, stock tasks, and stock transforms.

public ref class HResults
public class HResults
Public Class HResults
Inheritance
HResultsHResultsHResults

Remarks

For a list of all the HRESULTs defined in this class that also includes the numeric values for each message in both hexadecimal and decimal format, see Integration Services Error and Message Reference.

The messages and HRESULTs follow a naming convention. Error HRESULTs begin with DTS_E_, and end with the description of the failed operation. Warning messages and HRESULTs begin with DTS_W_, and end with the description of the warning operation. Information messages and HRESULTs begin with DTS_I_, and end with the description of the operation. Success messages and HRESULTs begin with DTS_S_, and end with the description of the successful operation. Messages for the event log begin with DTS_MSG_, and end with the description of the message.

Constructors

HResults() HResults() HResults()

Initializes a new instance of the HResults class.

Fields

DTS_E_64BITVARIABLERECAST DTS_E_64BITVARIABLERECAST DTS_E_64BITVARIABLERECAST

The variable "%1" is a 64-bit integer variable, which is not supported on this operating system. The variable has been recast to 32-bit integer.

DTS_E_ABORTTRANSACTION DTS_E_ABORTTRANSACTION DTS_E_ABORTTRANSACTION

Aborts the connection transaction.

DTS_E_ACQUIRECONNECTIONWORKINGOFFLINE DTS_E_ACQUIRECONNECTIONWORKINGOFFLINE DTS_E_ACQUIRECONNECTIONWORKINGOFFLINE

The connection from the connection manager acquires to work offline.

DTS_E_ACQUIREDCONNECTIONISINVALID DTS_E_ACQUIREDCONNECTIONISINVALID DTS_E_ACQUIREDCONNECTIONISINVALID

The connection acquired from the connection manager "%1" is not valid.

DTS_E_ACQUIREDCONNECTIONUNAVAILABLE DTS_E_ACQUIREDCONNECTIONUNAVAILABLE DTS_E_ACQUIREDCONNECTIONUNAVAILABLE

Unable to access the acquired connections.

DTS_E_ADDROWTOBUFFERFAILED DTS_E_ADDROWTOBUFFERFAILED DTS_E_ADDROWTOBUFFERFAILED

The attempt to add a row to the Data Flow task buffer failed with error code 0x%1!8.8X!.

DTS_E_ADODESTARGUMENTEXCEPTION DTS_E_ADODESTARGUMENTEXCEPTION DTS_E_ADODESTARGUMENTEXCEPTION

An argument exception has occurred while data provider tries to insert data to destination. The returned message is : __.

DTS_E_ADODESTCOLUMNERRORDISPNOTSUPPORTED DTS_E_ADODESTCOLUMNERRORDISPNOTSUPPORTED DTS_E_ADODESTCOLUMNERRORDISPNOTSUPPORTED

The input column error disposition is not supported by ADO NET Destination component.

DTS_E_ADODESTCOLUMNTRUNDISPNOTSUPPORTED DTS_E_ADODESTCOLUMNTRUNDISPNOTSUPPORTED DTS_E_ADODESTCOLUMNTRUNDISPNOTSUPPORTED

The input column truncation disposition is not supported by ADO NET Destination component.

DTS_E_ADODESTCONNECTIONTYPENOTSUPPORTED DTS_E_ADODESTCONNECTIONTYPENOTSUPPORTED DTS_E_ADODESTCONNECTIONTYPENOTSUPPORTED

Failed to retrieve the provider invariant name from __, it is currently not supported by ADO NET Destination component.

DTS_E_ADODESTDATATYPENOTSUPPORTED DTS_E_ADODESTDATATYPENOTSUPPORTED DTS_E_ADODESTDATATYPENOTSUPPORTED

The data type "" found on column "__" is not supported for the .

DTS_E_ADODESTERRORUPDATEROW DTS_E_ADODESTERRORUPDATEROW DTS_E_ADODESTERRORUPDATEROW

An error has occurred while sending this row to destination data source.

DTS_E_ADODESTEXECUTEREADEREXCEPTION DTS_E_ADODESTEXECUTEREADEREXCEPTION DTS_E_ADODESTEXECUTEREADEREXCEPTION

Executing SQL command throws an exception, the message is : __.

DTS_E_ADODESTEXTERNALCOLNOTEXIST DTS_E_ADODESTEXTERNALCOLNOTEXIST DTS_E_ADODESTEXTERNALCOLNOTEXIST

The __ does not exist in the database. It may have been removed or renamed.

DTS_E_ADODESTFAILEDTOACQUIRECONNECTION DTS_E_ADODESTFAILEDTOACQUIRECONNECTION DTS_E_ADODESTFAILEDTOACQUIRECONNECTION

The ADO NET Destination has failed to acquire the connection __. The connection may have been corrupted.

DTS_E_ADODESTGETSCHEMATABLEFAILED DTS_E_ADODESTGETSCHEMATABLEFAILED DTS_E_ADODESTGETSCHEMATABLEFAILED

Failed to get properties of external columns. The table name you entered may not exist, or you do not have SELECT permission on the table object and an alternative attempt to get column properties through connection has failed. Detailed error messages are: __.

DTS_E_ADODESTINPUTTRUNDISPNOTSUPPORTED DTS_E_ADODESTINPUTTRUNDISPNOTSUPPORTED DTS_E_ADODESTINPUTTRUNDISPNOTSUPPORTED

The input truncation row disposition is not supported by ADO NET Destination component.

DTS_E_ADODESTINSERTIONFAILURE DTS_E_ADODESTINSERTIONFAILURE DTS_E_ADODESTINSERTIONFAILURE

An exception has occurred during data insertion, the message returned from the provider is: __.

DTS_E_ADODESTNOERROROUTPUT DTS_E_ADODESTNOERROROUTPUT DTS_E_ADODESTNOERROROUTPUT

The destination component does not have an error output. It may have been corrupted.

DTS_E_ADODESTNOLINEAGEID DTS_E_ADODESTNOLINEAGEID DTS_E_ADODESTNOLINEAGEID

The lineage ID associated with external column does not exist at run time.

DTS_E_ADODESTNOTMANAGEDCONNECTION DTS_E_ADODESTNOTMANAGEDCONNECTION DTS_E_ADODESTNOTMANAGEDCONNECTION

The specified connection __ is not managed, please use managed connection for ADO NET destination.

DTS_E_ADODESTSQLBULKCOPYCREATIONEXCEPTION DTS_E_ADODESTSQLBULKCOPYCREATIONEXCEPTION DTS_E_ADODESTSQLBULKCOPYCREATIONEXCEPTION

Creating a bulk copy that throws an exception.

DTS_E_ADODESTTABLENAMEERROR DTS_E_ADODESTTABLENAMEERROR DTS_E_ADODESTTABLENAMEERROR

The Table or View name is not expected. \n\t If you are quoting the table name, please use the prefix and the suffix of your selected data provider for quotation. \n\t If you are using multipart name, please use at most three parts for the table name.

DTS_E_ADODESTWRONGBATCHSIZE DTS_E_ADODESTWRONGBATCHSIZE DTS_E_ADODESTWRONGBATCHSIZE

The BatchSize property must be a non-negative integer.

DTS_E_ADOSOURCEFAILEDTOACQUIRECONNECTION DTS_E_ADOSOURCEFAILEDTOACQUIRECONNECTION DTS_E_ADOSOURCEFAILEDTOACQUIRECONNECTION

The ADO NET source has failed to acquire the connection.

DTS_E_ADOSRCCOLUMNNOTINSCHEMAROWSET DTS_E_ADOSRCCOLUMNNOTINSCHEMAROWSET DTS_E_ADOSRCCOLUMNNOTINSCHEMAROWSET

The %1 does not have a matching source column in the DataReader schema.

DTS_E_ADOSRCDATATYPEMISMATCH DTS_E_ADOSRCDATATYPEMISMATCH DTS_E_ADOSRCDATATYPEMISMATCH

The data type of "%1" does not match the data type "%2" of the source column "%3".

DTS_E_ADOSRCINVALIDSQLCOMMAND DTS_E_ADOSRCINVALIDSQLCOMMAND DTS_E_ADOSRCINVALIDSQLCOMMAND

An error occurred executing the provided SQL command.

DTS_E_ADOSRCOUTPUTCOLUMNDATATYPECANNOTBECHANGED DTS_E_ADOSRCOUTPUTCOLUMNDATATYPECANNOTBECHANGED DTS_E_ADOSRCOUTPUTCOLUMNDATATYPECANNOTBECHANGED

The data type of output columns on the %1 cannot be changed.

DTS_E_ADOSRCUNKNOWNTYPEMAPPEDTONTEXT DTS_E_ADOSRCUNKNOWNTYPEMAPPEDTONTEXT DTS_E_ADOSRCUNKNOWNTYPEMAPPEDTONTEXT

The data type "" found on column "__" is not supported for the . This column will be converted to DT_NTEXT.

DTS_E_ALREADYADDED DTS_E_ALREADYADDED DTS_E_ALREADYADDED

The executable has been added to the Executables collection of another container. This occurs when a client tries to add an executable to more than one Executables collection. You need to remove the executable from the current Executables collection before attempting to add it.

DTS_E_ALREADYATTACHED DTS_E_ALREADYATTACHED DTS_E_ALREADYATTACHED

The %1 is already attached and cannot be attached again. Detach it and try again.

DTS_E_ALREADYCONNECTED DTS_E_ALREADYCONNECTED DTS_E_ALREADYCONNECTED

The component is already connected. The component needs to be disconnected before attempting to connect it.

DTS_E_ALREADYEXECUTING DTS_E_ALREADYEXECUTING DTS_E_ALREADYEXECUTING

The Execute call failed because the executable is already executing. This error occurs when the client calls Execute on a container that is still executing from the last Execute call.

DTS_E_AMBIGUOUSVARIABLENAME DTS_E_AMBIGUOUSVARIABLENAME DTS_E_AMBIGUOUSVARIABLENAME

The variable name is ambiguous because multiple variables with this name exist in different namespaces. Specify namespace-qualified name to prevent ambiguity.

DTS_E_ATLEASTONEINPUTMUSTBEMAPPEDTOOUTPUT DTS_E_ATLEASTONEINPUTMUSTBEMAPPEDTOOUTPUT DTS_E_ATLEASTONEINPUTMUSTBEMAPPEDTOOUTPUT

The inputs were not mapped to an output. The "%1" must have at least one input column mapped to an output column.

DTS_E_ATTEMPTINGTOINSERTINTOAREADONLYCOLUMN DTS_E_ATTEMPTINGTOINSERTINTOAREADONLYCOLUMN DTS_E_ATTEMPTINGTOINSERTINTOAREADONLYCOLUMN

Failure inserting into the read-only column "%1".

DTS_E_ATTEMPTINGTOINSERTINTOAROWIDCOLUMN DTS_E_ATTEMPTINGTOINSERTINTOAROWIDCOLUMN DTS_E_ATTEMPTINGTOINSERTINTOAROWIDCOLUMN

The "%1" is a row ID column and cannot be included in a data insertion operation.

DTS_E_ATTEMPTINGTOINSERTINTOAROWVERCOLUMN DTS_E_ATTEMPTINGTOINSERTINTOAROWVERCOLUMN DTS_E_ATTEMPTINGTOINSERTINTOAROWVERCOLUMN

Attempting insertion into the row version column "%1". Cannot insert into a row version column.

DTS_E_AXTASK_EMPTY_SCRIPT DTS_E_AXTASK_EMPTY_SCRIPT DTS_E_AXTASK_EMPTY_SCRIPT

The function is not found.

DTS_E_AXTASK_HANDLER_NOT_FOUND DTS_E_AXTASK_HANDLER_NOT_FOUND DTS_E_AXTASK_HANDLER_NOT_FOUND

The handler is not found.

DTS_E_AXTASK_INITIALIZATION_WITH_WRONG_XML_ELEMENT DTS_E_AXTASK_INITIALIZATION_WITH_WRONG_XML_ELEMENT DTS_E_AXTASK_INITIALIZATION_WITH_WRONG_XML_ELEMENT

An ActiveX Script Task was initiated with a wrong XML element.

DTS_E_AXTASK_MISSING_ENTRY_METHOD_NAME DTS_E_AXTASK_MISSING_ENTRY_METHOD_NAME DTS_E_AXTASK_MISSING_ENTRY_METHOD_NAME

The function is not found.

DTS_E_AXTASKUTIL_ADDTYPELIB_FAILED DTS_E_AXTASKUTIL_ADDTYPELIB_FAILED DTS_E_AXTASKUTIL_ADDTYPELIB_FAILED

An error occurred while adding the managed type library to the script host. Verify that the DTS 2000 runtime is installed.

DTS_E_AXTASKUTIL_ADDVARIABLES_FAILED DTS_E_AXTASKUTIL_ADDVARIABLES_FAILED DTS_E_AXTASKUTIL_ADDVARIABLES_FAILED

An error occurred while adding the SSIS variables to the script host namespace. This might prevent the task from using SSIS variables in the script.

DTS_E_AXTASKUTIL_ENUMERATE_LANGUAGES_FAILED DTS_E_AXTASKUTIL_ENUMERATE_LANGUAGES_FAILED DTS_E_AXTASKUTIL_ENUMERATE_LANGUAGES_FAILED

An error occurred while attempting to retrieve the scripting languages installed on the system.

DTS_E_AXTASKUTIL_EXECUTION_FAILED DTS_E_AXTASKUTIL_EXECUTION_FAILED DTS_E_AXTASKUTIL_EXECUTION_FAILED

An error occurred while executing the script. Verify that the script engine for the selected language is installed properly.

DTS_E_AXTASKUTIL_MSG_BAD_FUNCTION DTS_E_AXTASKUTIL_MSG_BAD_FUNCTION DTS_E_AXTASKUTIL_MSG_BAD_FUNCTION

The function name entered is not valid. Verify that a valid function name has been specified.

DTS_E_AXTASKUTIL_SCRIPT_PARSING_FAILED DTS_E_AXTASKUTIL_SCRIPT_PARSING_FAILED DTS_E_AXTASKUTIL_SCRIPT_PARSING_FAILED

A fatal error occurred while trying to parse the script text. Verify that the script engine for the chosen language is installed properly.

DTS_E_AXTASKUTIL_SCRIPTHOST_CREATE_FAILED DTS_E_AXTASKUTIL_SCRIPTHOST_CREATE_FAILED DTS_E_AXTASKUTIL_SCRIPTHOST_CREATE_FAILED

An error occurred while creating the ActiveX script host. Verify that you have the script host installed properly.

DTS_E_AXTASKUTIL_SCRIPTHOSTINIT_FAILED DTS_E_AXTASKUTIL_SCRIPTHOSTINIT_FAILED DTS_E_AXTASKUTIL_SCRIPTHOSTINIT_FAILED

An error occurred while trying to instantiate the script host for the chosen language. Verify that the script language you have chosen is installed on your system.

DTS_E_BACKPRESSURE_ALLINPUTSCLOSED DTS_E_BACKPRESSURE_ALLINPUTSCLOSED DTS_E_BACKPRESSURE_ALLINPUTSCLOSED

All inputs in the back pressure is closed.

DTS_E_BACKPRESSURE_BADDEPENDENTCOUNT DTS_E_BACKPRESSURE_BADDEPENDENTCOUNT DTS_E_BACKPRESSURE_BADDEPENDENTCOUNT

The number of bad dependents in the back pressure.

DTS_E_BACKPRESSURE_DEPENDONEORINPUT DTS_E_BACKPRESSURE_DEPENDONEORINPUT DTS_E_BACKPRESSURE_DEPENDONEORINPUT

The depend one or input back pressure.

DTS_E_BEGINTRANSACTION DTS_E_BEGINTRANSACTION DTS_E_BEGINTRANSACTION

The SSIS Runtime has failed to start the distributed transaction due to error 0x%1!8.8X! "%2". The DTC transaction failed to start. This could occur because the MSDTC Service is not running.

DTS_E_BINARYCODENOTFOUND DTS_E_BINARYCODENOTFOUND DTS_E_BINARYCODENOTFOUND

The script component is configured to pre-compile the script, but binary code is not found. Please visit the IDE in Script Component Editor by clicking Design Script button to cause binary code to be generated.

DTS_E_BITASK_CANNOT_ACQUIRE_CONNECTION DTS_E_BITASK_CANNOT_ACQUIRE_CONNECTION DTS_E_BITASK_CANNOT_ACQUIRE_CONNECTION

Failed to acquire the specified connection: "%1".

DTS_E_BITASK_CANNOT_RETRIEVE_COLUMN_INFO DTS_E_BITASK_CANNOT_RETRIEVE_COLUMN_INFO DTS_E_BITASK_CANNOT_RETRIEVE_COLUMN_INFO

An error occurred while retrieving the columns of the table.

DTS_E_BITASK_CANNOT_RETRIEVE_TABLES DTS_E_BITASK_CANNOT_RETRIEVE_TABLES DTS_E_BITASK_CANNOT_RETRIEVE_TABLES

An error occurred while retrieving the tables from the database.

DTS_E_BITASK_CANNOTRETAINCONNINTRANSACTION DTS_E_BITASK_CANNOTRETAINCONNINTRANSACTION DTS_E_BITASK_CANNOTRETAINCONNINTRANSACTION

The task cannot have a retained connection manager in a transaction.

DTS_E_BITASK_DATA_FILE_NOT_SPECIFIED DTS_E_BITASK_DATA_FILE_NOT_SPECIFIED DTS_E_BITASK_DATA_FILE_NOT_SPECIFIED

The data file name is not specified.

DTS_E_BITASK_DESTINATION_TABLE_NOT_SPECIFIED DTS_E_BITASK_DESTINATION_TABLE_NOT_SPECIFIED DTS_E_BITASK_DESTINATION_TABLE_NOT_SPECIFIED

You must specify a table name to continue.

DTS_E_BITASK_ERROR_IN_DB_OPERATION DTS_E_BITASK_ERROR_IN_DB_OPERATION DTS_E_BITASK_ERROR_IN_DB_OPERATION

An error occurred in the database operation.

DTS_E_BITASK_ERROR_IN_LOAD_FROM_XML DTS_E_BITASK_ERROR_IN_LOAD_FROM_XML DTS_E_BITASK_ERROR_IN_LOAD_FROM_XML

An error occurred in LoadFromXML at the tag "%1".

DTS_E_BITASK_ERROR_IN_SAVE_TO_XML DTS_E_BITASK_ERROR_IN_SAVE_TO_XML DTS_E_BITASK_ERROR_IN_SAVE_TO_XML

An error occurred in SaveToXML at the tag "%1".

DTS_E_BITASK_EXECUTE_FAILED DTS_E_BITASK_EXECUTE_FAILED DTS_E_BITASK_EXECUTE_FAILED

The execution failed.

DTS_E_BITASK_EXECUTION_FAILED DTS_E_BITASK_EXECUTION_FAILED DTS_E_BITASK_EXECUTION_FAILED

The bulk insert execution failed.

DTS_E_BITASK_HANDLER_NOT_FOUND DTS_E_BITASK_HANDLER_NOT_FOUND DTS_E_BITASK_HANDLER_NOT_FOUND

The handler is not found.

DTS_E_BITASK_INITIALIZATION_WITH_WRONG_XML_ELEMENT DTS_E_BITASK_INITIALIZATION_WITH_WRONG_XML_ELEMENT DTS_E_BITASK_INITIALIZATION_WITH_WRONG_XML_ELEMENT

The Bulk Insert Task was initiated with a wrong XML element.

DTS_E_BITASK_INVALID_CONNECTION DTS_E_BITASK_INVALID_CONNECTION DTS_E_BITASK_INVALID_CONNECTION

The connection is not valid.

DTS_E_BITASK_INVALIDDESTCONNECTIONNAME DTS_E_BITASK_INVALIDDESTCONNECTIONNAME DTS_E_BITASK_INVALIDDESTCONNECTIONNAME

The destination connection specified is not valid. Supply a valid connection to continue.

DTS_E_BITASK_INVALIDSOURCECONNECTIONNAME DTS_E_BITASK_INVALIDSOURCECONNECTIONNAME DTS_E_BITASK_INVALIDSOURCECONNECTIONNAME

The specified connection "%1" is either not valid, or points to an invalid object. To continue, specify a valid connection.

DTS_E_BITASK_NO_CONNECTION_MANAGER_SPECIFIED DTS_E_BITASK_NO_CONNECTION_MANAGER_SPECIFIED DTS_E_BITASK_NO_CONNECTION_MANAGER_SPECIFIED

An attempt to obtain the Connection Manager failed.

DTS_E_BITASK_NULL_CONNECTION DTS_E_BITASK_NULL_CONNECTION DTS_E_BITASK_NULL_CONNECTION

The connection is null.

DTS_E_BITASKUNMANCONNECTION_CANNOT_OPEN_FILE DTS_E_BITASKUNMANCONNECTION_CANNOT_OPEN_FILE DTS_E_BITASKUNMANCONNECTION_CANNOT_OPEN_FILE

An error occurred while trying to open the data file.

DTS_E_BITASKUNMANCONNECTION_CANNOT_RETRIEVE_COLUMN_INFO DTS_E_BITASKUNMANCONNECTION_CANNOT_RETRIEVE_COLUMN_INFO DTS_E_BITASKUNMANCONNECTION_CANNOT_RETRIEVE_COLUMN_INFO

An error occurred while retrieving the columns of the table.

DTS_E_BITASKUNMANCONNECTION_CANNOT_RETRIEVE_TABLES DTS_E_BITASKUNMANCONNECTION_CANNOT_RETRIEVE_TABLES DTS_E_BITASKUNMANCONNECTION_CANNOT_RETRIEVE_TABLES

An error occurred while retrieving the tables from the database.

DTS_E_BITASKUNMANCONNECTION_ERROR_IN_DB_OPERATION DTS_E_BITASKUNMANCONNECTION_ERROR_IN_DB_OPERATION DTS_E_BITASKUNMANCONNECTION_ERROR_IN_DB_OPERATION

An error occurred in database operation.

DTS_E_BITASKUNMANCONNECTION_EXECUTE_FAILED DTS_E_BITASKUNMANCONNECTION_EXECUTE_FAILED DTS_E_BITASKUNMANCONNECTION_EXECUTE_FAILED

The execution has failed.

DTS_E_BITASKUNMANCONNECTION_INVALID_CONNECTION DTS_E_BITASKUNMANCONNECTION_INVALID_CONNECTION DTS_E_BITASKUNMANCONNECTION_INVALID_CONNECTION

The connection is not valid.

DTS_E_BITASKUNMANCONNECTION_OEM_CONVERSION_FAILED DTS_E_BITASKUNMANCONNECTION_OEM_CONVERSION_FAILED DTS_E_BITASKUNMANCONNECTION_OEM_CONVERSION_FAILED

The input OEM file cannot be converted to the specified format.

DTS_E_BLANKOUTPUTCOLUMNNAME DTS_E_BLANKOUTPUTCOLUMNNAME DTS_E_BLANKOUTPUTCOLUMNNAME

The name for "%1" is blank, and names cannot be blank.

DTS_E_BPDUPLICATE DTS_E_BPDUPLICATE DTS_E_BPDUPLICATE

The specified breakpoint ID already exists. This error occurs when a task calls CreateBreakpoint with the same ID multiple times. It is possible to create a breakpoint with the same ID multiple times if the task calls RemoveBreakpoint on the first creation before creating the second one.

DTS_E_BPUNKNOWNID DTS_E_BPUNKNOWNID DTS_E_BPUNKNOWNID

The specified breakpoint ID does not exist. This error occurs when a task references a breakpoint that does not exist.

DTS_E_BUFFERALLOCFAILED DTS_E_BUFFERALLOCFAILED DTS_E_BUFFERALLOCFAILED

A buffer failed while allocating %1!d! bytes.

DTS_E_BUFFERBADSIZE DTS_E_BUFFERBADSIZE DTS_E_BUFFERBADSIZE

The Buffer Type %1!d! had a size of %2!I64d! bytes.

DTS_E_BUFFERFAILUREDETAILS DTS_E_BUFFERFAILUREDETAILS DTS_E_BUFFERFAILUREDETAILS

The system reports %1!d! percent memory load. There are %2 bytes of physical memory with %3 bytes free. There are %4 bytes of virtual memory with %5 bytes free. The paging file has %6 bytes with %7 bytes free.

DTS_E_BUFFERGETTEMPFILENAME DTS_E_BUFFERGETTEMPFILENAME DTS_E_BUFFERGETTEMPFILENAME

The buffer manager could not get a temporary file name. The call to GetTempFileName failed.

DTS_E_BUFFERISEOR DTS_E_BUFFERISEOR DTS_E_BUFFERISEOR

This buffer represents the end of the rowset and its row count cannot be altered. An attempt was made to call AddRow or RemoveRow on a buffer that has the end of rowset flag.

DTS_E_BUFFERISFLAT DTS_E_BUFFERISFLAT DTS_E_BUFFERISFLAT

The private mode buffers do not support this operation.

DTS_E_BUFFERISNOTPRIMEOUTPUT DTS_E_BUFFERISNOTPRIMEOUTPUT DTS_E_BUFFERISNOTPRIMEOUTPUT

The method was called on the wrong buffer. Buffers that are not used for component output do not support this operation.

DTS_E_BUFFERISPRIMEOUTPUT DTS_E_BUFFERISPRIMEOUTPUT DTS_E_BUFFERISPRIMEOUTPUT

This operation cannot be called on a buffer passed to PrimeOutput. A call was made to a buffer method during PrimeOutput, but that call is not allowed during PrimeOutput.

DTS_E_BUFFERISPRIVATE DTS_E_BUFFERISPRIVATE DTS_E_BUFFERISPRIVATE

A call was made to a buffer method on a private buffer and private buffers do not support this operation.

DTS_E_BUFFERISPROCESSINPUT DTS_E_BUFFERISPROCESSINPUT DTS_E_BUFFERISPROCESSINPUT

This operation cannot be called on a buffer passed to ProcessInput. A call was made to a buffer method during ProcessInput, but that call is not allowed during ProcessInput.

DTS_E_BUFFERISREADONLY DTS_E_BUFFERISREADONLY DTS_E_BUFFERISREADONLY

This operation could not be performed because buffer is in read-only mode. A read-only buffer cannot be modified.

DTS_E_BUFFERLOCKUNDERFLOW DTS_E_BUFFERLOCKUNDERFLOW DTS_E_BUFFERLOCKUNDERFLOW

The buffer was already unlocked.

DTS_E_BUFFERMAXROWSIZEOUTOFRANGE DTS_E_BUFFERMAXROWSIZEOUTOFRANGE DTS_E_BUFFERMAXROWSIZEOUTOFRANGE

The default buffer maximum rows must be larger than %1!d! rows. An attempt was made to set the DefaultBufferMaxRows property to a value that is too small.

DTS_E_BUFFERNOMAPMEMORY DTS_E_BUFFERNOMAPMEMORY DTS_E_BUFFERNOMAPMEMORY

An out-of-memory condition prevents the mapping of a buffer's lineage IDs to DTP_HCOL indexes.

DTS_E_BUFFERNOOBJECTMEMORY DTS_E_BUFFERNOOBJECTMEMORY DTS_E_BUFFERNOOBJECTMEMORY

An out-of-memory condition prevented the creation of the buffer object.

DTS_E_BUFFERNOTLOCKED DTS_E_BUFFERNOTLOCKED DTS_E_BUFFERNOTLOCKED

This buffer is not locked and cannot be manipulated.

DTS_E_BUFFERORPHANED DTS_E_BUFFERORPHANED DTS_E_BUFFERORPHANED

This buffer has been orphaned. The buffer manager has shut down, leaving an outstanding buffer and no cleanup will occur for the buffer. There is a potential for memory leaks and other problems.

DTS_E_BUFFERSIZEOUTOFRANGE DTS_E_BUFFERSIZEOUTOFRANGE DTS_E_BUFFERSIZEOUTOFRANGE

The default buffer size must be between %1!d! and %2!d! bytes. An attempt was made to set the DefaultBufferSize property to a value that is too small or too large.

DTS_E_BULKINSERTAPIPREPARATIONFAILED DTS_E_BULKINSERTAPIPREPARATIONFAILED DTS_E_BULKINSERTAPIPREPARATIONFAILED

The SSIS bulk insert for data insertion was unable to prepare.

DTS_E_BULKINSERTHREADINITIALIZATIONFAILED DTS_E_BULKINSERTHREADINITIALIZATIONFAILED DTS_E_BULKINSERTHREADINITIALIZATIONFAILED

The thread for the SSIS Bulk Insert task failed to initialize.

DTS_E_BULKINSERTTHREADABNORMALCOMPLETION DTS_E_BULKINSERTTHREADABNORMALCOMPLETION DTS_E_BULKINSERTTHREADABNORMALCOMPLETION

The thread for the SSIS Bulk Insert task terminated with errors or warnings.

DTS_E_BULKINSERTTHREADALREADYRUNNING DTS_E_BULKINSERTTHREADALREADYRUNNING DTS_E_BULKINSERTTHREADALREADYRUNNING

The thread for the SSIS Bulk Insert task is already running.

DTS_E_BULKINSERTTHREADTERMINATED DTS_E_BULKINSERTTHREADTERMINATED DTS_E_BULKINSERTTHREADTERMINATED

The thread for the SSIS Bulk Insert is no longer running. No more rows can be inserted. Try increasing the bulk insert thread timeout.

DTS_E_CACHE_DUPLICATE_INDEXPOS DTS_E_CACHE_DUPLICATE_INDEXPOS DTS_E_CACHE_DUPLICATE_INDEXPOS

The index position, __, is a duplicate. For non-index columns, the index position should be 0. For index columns, the index position should be a sequential, positive number.

DTS_E_CACHE_INDEXPOS_NOT_CONTINUOUS DTS_E_CACHE_INDEXPOS_NOT_CONTINUOUS DTS_E_CACHE_INDEXPOS_NOT_CONTINUOUS

The cache index positions must be contiguous. For non-index columns, the index position should be 0. For index columns, the index position should be a sequential, positive number.

DTS_E_CACHE_INVALID_INDEXPOS DTS_E_CACHE_INVALID_INDEXPOS DTS_E_CACHE_INVALID_INDEXPOS

The cache index position, __, is not valid. For non-index columns, the index position should be 0. For index columns, the index position should be a sequential, positive number.

DTS_E_CACHE_TOO_FEW_INDEX_COLUMNS DTS_E_CACHE_TOO_FEW_INDEX_COLUMNS DTS_E_CACHE_TOO_FEW_INDEX_COLUMNS

At least one index column should be specified for the Cache connection manager. To specify an index column, set the Index Position property of the cache column.

DTS_E_CACHEBADHEADER DTS_E_CACHEBADHEADER DTS_E_CACHEBADHEADER

The cache file is damaged, or the file was not created by using the Cache connection manager. Provides a valid cache file.

DTS_E_CACHECOLDATATYPEINCOMPAT DTS_E_CACHECOLDATATYPEINCOMPAT DTS_E_CACHECOLDATATYPEINCOMPAT

The input column, _, and the cache column, "\_", cannot be mapped because the data types do not match.

DTS_E_CACHECOLDATATYPEPROPINCOMPAT DTS_E_CACHECOLDATATYPEPROPINCOMPAT DTS_E_CACHECOLDATATYPEPROPINCOMPAT

The input column, "_", and the cache column, "\_", cannot be mapped because one or more data type properties do not match.

DTS_E_CACHECOLINDEXPOSMISMATCH DTS_E_CACHECOLINDEXPOSMISMATCH DTS_E_CACHECOLINDEXPOSMISMATCH

The index position of column, "_", is different from index position of Cache connection manager column, "\_".

DTS_E_CACHECOLUMNMAPPINGFAILED DTS_E_CACHECOLUMNMAPPINGFAILED DTS_E_CACHECOLUMNMAPPINGFAILED

Failed to map to a cache column. The HResult is .

DTS_E_CACHECOLUMNOTFOUND DTS_E_CACHECOLUMNOTFOUND DTS_E_CACHECOLUMNOTFOUND

The cache column "__" was not found in the cache.

DTS_E_CACHEFILEWRITEFAILED DTS_E_CACHEFILEWRITEFAILED DTS_E_CACHEFILEWRITEFAILED

The failed to write the cache to file "". The hresult is __.

DTS_E_CACHELOADEDFROMFILE DTS_E_CACHELOADEDFROMFILE DTS_E_CACHELOADEDFROMFILE

The cannot write to the cache because the cache has been loaded from a file by .

DTS_E_CACHERELOADEDDIFFERENTFILES DTS_E_CACHERELOADEDDIFFERENTFILES DTS_E_CACHERELOADEDDIFFERENTFILES

The cannot load the cache from file "" because the cache has already been loaded from file "__".

DTS_E_CANCELRECEIVED DTS_E_CANCELRECEIVED DTS_E_CANCELRECEIVED

The pipeline received a request to cancel and is shutting down.

DTS_E_CANNOT_MODIFY_PROJECT_PARAMETERS_COLLECTION DTS_E_CANNOT_MODIFY_PROJECT_PARAMETERS_COLLECTION DTS_E_CANNOT_MODIFY_PROJECT_PARAMETERS_COLLECTION

The project parameters collection cannot be modified.

DTS_E_CANNOTACCESSDTSAPPLICATIONOBJECT DTS_E_CANNOTACCESSDTSAPPLICATIONOBJECT DTS_E_CANNOTACCESSDTSAPPLICATIONOBJECT

The Application object cannot be accessed. Verify that SSIS is correctly installed.

DTS_E_CANNOTACQUIRECONNECTIONFROMCONNECTIONMANAGER DTS_E_CANNOTACQUIRECONNECTIONFROMCONNECTIONMANAGER DTS_E_CANNOTACQUIRECONNECTIONFROMCONNECTIONMANAGER

SSIS Error Code DTS_E_CANNOTACQUIRECONNECTIONFROMCONNECTIONMANAGER. The AcquireConnection method call to the connection manager "%1" failed with error code 0x%2!8.8X!. There may be error messages posted before this with more information on why the AcquireConnection method call failed.

DTS_E_CANNOTACQUIREMANAGEDCONNECTIONFROMCONNECTIONMANAGER DTS_E_CANNOTACQUIREMANAGEDCONNECTIONFROMCONNECTIONMANAGER DTS_E_CANNOTACQUIREMANAGEDCONNECTIONFROMCONNECTIONMANAGER

A managed connection cannot be acquired from the run-time connection manager.

DTS_E_CANNOTCASTTOIDTSOBJECEVERSIONUPDATE DTS_E_CANNOTCASTTOIDTSOBJECEVERSIONUPDATE DTS_E_CANNOTCASTTOIDTSOBJECEVERSIONUPDATE

Cannot cast to IDTS object version update.

DTS_E_CANNOTCHANGEPROTECTIONLEVELSCM DTS_E_CANNOTCHANGEPROTECTIONLEVELSCM DTS_E_CANNOTCHANGEPROTECTIONLEVELSCM

The protection levels of the connection manager cannot be changed.

DTS_E_CANNOTCLONECONNECTIONMANAGER DTS_E_CANNOTCLONECONNECTIONMANAGER DTS_E_CANNOTCLONECONNECTIONMANAGER

The connection manager "0x%1" cannot be cloned for out-of-process execution.

DTS_E_CANNOTCONVERTBETWEENUNICODEANDNONUNICODESTRINGCOLUMN DTS_E_CANNOTCONVERTBETWEENUNICODEANDNONUNICODESTRINGCOLUMN DTS_E_CANNOTCONVERTBETWEENUNICODEANDNONUNICODESTRINGCOLUMN

The column "%1" cannot convert between Unicode and non-Unicode string data types.

DTS_E_CANNOTCONVERTBETWEENUNICODEANDNONUNICODESTRINGCOLUMNS DTS_E_CANNOTCONVERTBETWEENUNICODEANDNONUNICODESTRINGCOLUMNS DTS_E_CANNOTCONVERTBETWEENUNICODEANDNONUNICODESTRINGCOLUMNS

The columns "%1" and "%2" cannot convert between Unicode and non-Unicode string data types.

DTS_E_CANNOTCONVERTDATATYPESWITHDIFFERENTCODEPAGES DTS_E_CANNOTCONVERTDATATYPESWITHDIFFERENTCODEPAGES DTS_E_CANNOTCONVERTDATATYPESWITHDIFFERENTCODEPAGES

The conversion from "%1" with code page %2!d! to "%3" with code page %4!d! is not supported.

DTS_E_CANNOTCONVERTTYPES DTS_E_CANNOTCONVERTTYPES DTS_E_CANNOTCONVERTTYPES

The conversion from "%1" to "%2" is not supported.

DTS_E_CANNOTCOPYORCONVERTFLATFILEDATA DTS_E_CANNOTCOPYORCONVERTFLATFILEDATA DTS_E_CANNOTCOPYORCONVERTFLATFILEDATA

The flat file data for column "%1" cannot be copied or converted.

DTS_E_CANNOTCREATEACCESSOR DTS_E_CANNOTCREATEACCESSOR DTS_E_CANNOTCREATEACCESSOR

An OLE DB accessor cannot be created. Verify that the column metadata is valid.

DTS_E_CANNOTCREATEBULKINSERTHREAD DTS_E_CANNOTCREATEBULKINSERTHREAD DTS_E_CANNOTCREATEBULKINSERTHREAD

The bulk insert thread cannot be created due to error "%1".

DTS_E_CANNOTFINDRUNTIMECONNECTIONMANAGER DTS_E_CANNOTFINDRUNTIMECONNECTIONMANAGER DTS_E_CANNOTFINDRUNTIMECONNECTIONMANAGER

The runtime connection manager with the ID "%1" cannot be found. Verify that the connection manager collection has a connection manager with that ID.

DTS_E_CANNOTGETCOLUMNNAME DTS_E_CANNOTGETCOLUMNNAME DTS_E_CANNOTGETCOLUMNNAME

The name of the column with ID %1!d! cannot be acquired.

DTS_E_CANNOTGETIROWSET DTS_E_CANNOTGETIROWSET DTS_E_CANNOTGETIROWSET

Opening a rowset for "%1" failed. Check that the object exists in the database.

DTS_E_CANNOTGETIROWSETFASTLOAD DTS_E_CANNOTGETIROWSETFASTLOAD DTS_E_CANNOTGETIROWSETFASTLOAD

Afastload rowset for "%1" failed to open. Check that the object exists in the database.

DTS_E_CANNOTGETRUNTIMECONNECTIONMANAGERID DTS_E_CANNOTGETRUNTIMECONNECTIONMANAGERID DTS_E_CANNOTGETRUNTIMECONNECTIONMANAGERID

The ID of the runtime connection manager specified by "%1" in the connection manager collection, Connections, of "%2" cannot be acquired due to error code 0x%3!8.8X!. Verify that the ConnectionManager.ID property of the runtime connection object has been set for the component.

DTS_E_CANNOTHAVEANYINPUTCOLUMNS DTS_E_CANNOTHAVEANYINPUTCOLUMNS DTS_E_CANNOTHAVEANYINPUTCOLUMNS

The input columns are not allowed. The number of input columns must be zero.

DTS_E_CANNOTHAVEINPUTS DTS_E_CANNOTHAVEINPUTS DTS_E_CANNOTHAVEINPUTS

This component has %1!d! inputs. No input is allowed on this component.

DTS_E_CANNOTHAVEZEROINPUTCOLUMNS DTS_E_CANNOTHAVEZEROINPUTCOLUMNS DTS_E_CANNOTHAVEZEROINPUTCOLUMNS

The number of input columns for %1 cannot be zero.

DTS_E_CANNOTHAVEZEROOUTPUTCOLUMNS DTS_E_CANNOTHAVEZEROOUTPUTCOLUMNS DTS_E_CANNOTHAVEZEROOUTPUTCOLUMNS

The number of output columns for %1 cannot be zero.

DTS_E_CANNOTLOADCOMPONENT DTS_E_CANNOTLOADCOMPONENT DTS_E_CANNOTLOADCOMPONENT

The managed pipeline component "%1" could not be loaded. The exception was: %2.

DTS_E_CANNOTLOADOLDPACKAGES DTS_E_CANNOTLOADOLDPACKAGES DTS_E_CANNOTLOADOLDPACKAGES

The package cannot be loaded. This occurs when attempting to load an older version package, or the package file refers to an invalid structured object.

DTS_E_CANNOTMAPINPUTCOLUMNTOOUTPUTCOLUMN DTS_E_CANNOTMAPINPUTCOLUMNTOOUTPUTCOLUMN DTS_E_CANNOTMAPINPUTCOLUMNTOOUTPUTCOLUMN

The input column with lineage ID "%1!d!" which is needed by "%2" cannot be found. Check SourceInputColumnLineageID custom property of the output column.

DTS_E_CANNOTMAPOUTPUTCOLUMN DTS_E_CANNOTMAPOUTPUTCOLUMN DTS_E_CANNOTMAPOUTPUTCOLUMN

The output column cannot be mapped to an external metadata column.

DTS_E_CANNOTMAPRUNTIMECONNECTIONMANAGER DTS_E_CANNOTMAPRUNTIMECONNECTIONMANAGER DTS_E_CANNOTMAPRUNTIMECONNECTIONMANAGER

The connection manager with ID "%1" in the connection manager collection due to error code 0x%2!8.8X! cannot be found. That connection manager is needed by "%3" in the connection manager collection of "%4". Verify that a connection manager in the connection manager collection, Connections, has been created with that ID.

DTS_E_CANNOTOPENDATAFILE DTS_E_CANNOTOPENDATAFILE DTS_E_CANNOTOPENDATAFILE

The datafile "%1" cannot be opened.

DTS_E_CANNOTOPENREGISTRYKEY DTS_E_CANNOTOPENREGISTRYKEY DTS_E_CANNOTOPENREGISTRYKEY

The registry key "%1" cannot be opened.

DTS_E_CANNOTREATTACHPATH DTS_E_CANNOTREATTACHPATH DTS_E_CANNOTREATTACHPATH

The "%1" cannot be reattached. Delete the path, add a new one, and attach it.

DTS_E_CANNOTRETRIEVEBYLINEAGE DTS_E_CANNOTRETRIEVEBYLINEAGE DTS_E_CANNOTRETRIEVEBYLINEAGE

Cannot retrieve an item by lineage ID from a collection that does not contain columns.

DTS_E_CANNOTRETRIEVEPROPERTYFORCOMPONENT DTS_E_CANNOTRETRIEVEPROPERTYFORCOMPONENT DTS_E_CANNOTRETRIEVEPROPERTYFORCOMPONENT

The property "%1" from component with ID %2!d! cannot be retrieved.

DTS_E_CANNOTTFINDRUNTIMECONNECTIONOBJECT DTS_E_CANNOTTFINDRUNTIMECONNECTIONOBJECT DTS_E_CANNOTTFINDRUNTIMECONNECTIONOBJECT

The connection "%1" cannot be found. Verify that the connection manager has a connection with that name.

DTS_E_CANNOTUPDATECACHEONINPUTCOLUMNS DTS_E_CANNOTUPDATECACHEONINPUTCOLUMNS DTS_E_CANNOTUPDATECACHEONINPUTCOLUMNS

The cache on input columns cannot be updated.

DTS_E_CANNOTWRITETODATAFILE DTS_E_CANNOTWRITETODATAFILE DTS_E_CANNOTWRITETODATAFILE

Cannot write to the data file.

DTS_E_CANONLYSETCOMPFLAGSONSOURCE DTS_E_CANONLYSETCOMPFLAGSONSOURCE DTS_E_CANONLYSETCOMPFLAGSONSOURCE

The ComparisonFlags property cannot be set to a non-zero value for "%1" because the "%2" is not a source output. The output column "colname" (ID) cannot have a ComparisonFlags property set to non-zero because its output "outputname" (ID) is not a source output.

DTS_E_CANONLYSETISSORTEDONSOURCE DTS_E_CANONLYSETISSORTEDONSOURCE DTS_E_CANONLYSETISSORTEDONSOURCE

The "%1" cannot have its IsSorted property set to TRUE because it is not a source output. A source output has a SynchronousInputID value of zero.

DTS_E_CANONLYSETSORTKEYONSOURCE DTS_E_CANONLYSETSORTKEYONSOURCE DTS_E_CANONLYSETSORTKEYONSOURCE

The "%1" cannot have a SortKeyPosition property set to non-zero because "%2" is not a source output. The output column "colname" (ID) cannot have its SortKeyPosition property set to non-zero because its output "outputname" (ID) is not a source output.

DTS_E_CANTACCESSARRAYDATA DTS_E_CANTACCESSARRAYDATA DTS_E_CANTACCESSARRAYDATA

The data in the array cannot be accessed (error: %1). This error can occur wherever GetDataFromSafeArray is called.

DTS_E_CANTADDBLOBDATA DTS_E_CANTADDBLOBDATA DTS_E_CANTADDBLOBDATA

The long data was retrieved for a column but cannot be added to the Data Flow task buffer.

DTS_E_CANTADDCOLUMN DTS_E_CANTADDCOLUMN DTS_E_CANTADDCOLUMN

The component does not allow adding columns to this input or output.

DTS_E_CANTADDINPUT DTS_E_CANTADDINPUT DTS_E_CANTADDINPUT

An input cannot be added to the inputs collection.

DTS_E_CANTADDOUTPUT DTS_E_CANTADDOUTPUT DTS_E_CANTADDOUTPUT

An output cannot be added to the outputs collection.

DTS_E_CANTADDOUTPUTID DTS_E_CANTADDOUTPUTID DTS_E_CANTADDOUTPUTID

The output ID %1!d! failed during insert. The new output was not created.

DTS_E_CANTADDREMOVEWHENEXECUTING DTS_E_CANTADDREMOVEWHENEXECUTING DTS_E_CANTADDREMOVEWHENEXECUTING

An element cannot be added or removed from a package in runtime mode. This error occurs when an attempt is made to add or remove an object from a collection while the package is executing.

DTS_E_CANTALLOCATECOLUMNINFO DTS_E_CANTALLOCATECOLUMNINFO DTS_E_CANTALLOCATECOLUMNINFO

Not enough memory was available to allocate a list of the columns that are being manipulated by this component.

DTS_E_CANTBUILDBUFFERTYPE DTS_E_CANTBUILDBUFFERTYPE DTS_E_CANTBUILDBUFFERTYPE

The Data Flow task cannot allocate memory to build a buffer definition. The buffer definition had %1!d! columns.

DTS_E_CANTBUILDTHREADPOOL DTS_E_CANTBUILDTHREADPOOL DTS_E_CANTBUILDTHREADPOOL

The Sort transformation could not create a thread pool with %1!d! threads. Not enough memory is available.

DTS_E_CANTCHANGEPROPERTYTYPE DTS_E_CANTCHANGEPROPERTYTYPE DTS_E_CANTCHANGEPROPERTYTYPE

The property type cannot be changed from the type that was set by the component.

DTS_E_CANTCHANGEREADONLYATRUNTIME DTS_E_CANTCHANGEREADONLYATRUNTIME DTS_E_CANTCHANGEREADONLYATRUNTIME

An attempt change to a read-only attribute on variable "%1" occurred. This error happens when a read-only attribute for a variable is being changed at runtime. Read-only attributes can be changed only at design time.

DTS_E_CANTCHANGEUSAGETYPE DTS_E_CANTCHANGEUSAGETYPE DTS_E_CANTCHANGEUSAGETYPE

The usage type of the column cannot be changed.

DTS_E_CANTCLONE DTS_E_CANTCLONE DTS_E_CANTCLONE

The input buffer could not be cloned. An out-of-memory condition occurred or there was an internal error.

DTS_E_CANTCOMPARE DTS_E_CANTCOMPARE DTS_E_CANTCOMPARE

The data type "%1" cannot be compared. Comparison of that data type is not supported, so it cannot be sorted or used as a key.

DTS_E_CANTCREATEBLOBFILE DTS_E_CANTCREATEBLOBFILE DTS_E_CANTCREATEBLOBFILE

The buffer manager cannot create a file to spool a long object on the directories named in the BLOBTempStoragePath property. Either an incorrect file name was provided, or there are no permissions.

DTS_E_CANTCREATEBUFFERMANAGER DTS_E_CANTCREATEBUFFERMANAGER DTS_E_CANTCREATEBUFFERMANAGER

The Buffer Manager could not be created.

DTS_E_CANTCREATECERTCONTEXT DTS_E_CANTCREATECERTCONTEXT DTS_E_CANTCREATECERTCONTEXT

Failed to create certificate context (error: %1). This occurs in CPackage::put_CertificateObject or CPackage::LoadFromXML when the corresponding CryptoAPI function fails.

DTS_E_CANTCREATECOMPONENT DTS_E_CANTCREATECOMPONENT DTS_E_CANTCREATECOMPONENT

The component "%1" could not be created and returned error code 0x%2!8.8X!. Make sure that the component is registered correctly.

DTS_E_CANTCREATECOMPONENTVIEW DTS_E_CANTCREATECOMPONENTVIEW DTS_E_CANTCREATECOMPONENTVIEW

A component view cannot be created because another one already exists. Only one component view can exist at a time.

DTS_E_CANTCREATECUSTOMPROPERTY DTS_E_CANTCREATECUSTOMPROPERTY DTS_E_CANTCREATECUSTOMPROPERTY

The custom property "%1" cannot be created.

DTS_E_CANTCREATEEXECUTIONTREE DTS_E_CANTCREATEEXECUTIONTREE DTS_E_CANTCREATEEXECUTIONTREE

There is not enough memory to create an execution tree.

DTS_E_CANTCREATENEWTYPE DTS_E_CANTCREATENEWTYPE DTS_E_CANTCREATENEWTYPE

The buffer manager failed to create a new buffer type.

DTS_E_CANTCREATEPRIMEOUTPUTBUFFER DTS_E_CANTCREATEPRIMEOUTPUTBUFFER DTS_E_CANTCREATEPRIMEOUTPUTBUFFER

The Data Flow task failed to create a buffer to call PrimeOutput for output "%3" (%4!d!) on component "%1" (%2!d!). This error usually occurs due to an out-of-memory condition.

DTS_E_CANTCREATESPOOLFILE DTS_E_CANTCREATESPOOLFILE DTS_E_CANTCREATESPOOLFILE

The buffer manager cannot create a temporary storage file on any path in the BufferTempStoragePath property. There is an incorrect file name or no permission.

DTS_E_CANTCREATEVIEWBUFFER DTS_E_CANTCREATEVIEWBUFFER DTS_E_CANTCREATEVIEWBUFFER

The Data Flow task engine failed to create a view buffer of type %1!d! over type %2!d! for buffer %3!d.

DTS_E_CANTCREATEVIRTUALBUFFER DTS_E_CANTCREATEVIRTUALBUFFER DTS_E_CANTCREATEVIRTUALBUFFER

The Data Flow task cannot create a virtual buffer to prepare for execution.

DTS_E_CANTDELETECOLUMN DTS_E_CANTDELETECOLUMN DTS_E_CANTDELETECOLUMN

The column cannot be deleted. The component does not allow columns to be deleted from this input or output.

DTS_E_CANTDELETEERRORCOLUMNS DTS_E_CANTDELETEERRORCOLUMNS DTS_E_CANTDELETEERRORCOLUMNS

The %1 is a special error output column and cannot be deleted.

DTS_E_CANTDELETEINPUT DTS_E_CANTDELETEINPUT DTS_E_CANTDELETEINPUT

An input cannot be deleted from the inputs collection.

DTS_E_CANTDELETEOUTPUT DTS_E_CANTDELETEOUTPUT DTS_E_CANTDELETEOUTPUT

An output cannot be removed from the outputs collection.

DTS_E_CANTDELETEOUTPUTID DTS_E_CANTDELETEOUTPUTID DTS_E_CANTDELETEOUTPUTID

The output ID %1!d! cannot be deleted from the output collection. The ID may not be valid, or the ID may have been the default or error output.

DTS_E_CANTDETERMINEWHICHPROPTOPERSIST DTS_E_CANTDETERMINEWHICHPROPTOPERSIST DTS_E_CANTDETERMINEWHICHPROPTOPERSIST

The object is unable to persist using default persistence. This error occurs when the default persistence is unable to determine which objects are on the hosted object.

DTS_E_CANTDIRECTROW DTS_E_CANTDIRECTROW DTS_E_CANTDIRECTROW

The direct row to output "%1" (%2!d!) failed.

DTS_E_CANTFINDCERTBYHASH DTS_E_CANTFINDCERTBYHASH DTS_E_CANTFINDCERTBYHASH

Unable to find the specified certificate by hash in "MY" store (error: %1). Occurs in CPackage::LoadUserCertificateByHash.

DTS_E_CANTFINDCERTBYNAME DTS_E_CANTFINDCERTBYNAME DTS_E_CANTFINDCERTBYNAME

The certificate specified by name in MY store cannot be found (error: %1). This occurs in CPackage::LoadUserCertificateByName.

DTS_E_CANTGETBLOBDATA DTS_E_CANTGETBLOBDATA DTS_E_CANTGETBLOBDATA

Failed to retrieve long data for column "%1".

DTS_E_CANTGETCERTDATA DTS_E_CANTGETCERTDATA DTS_E_CANTGETCERTDATA

The raw certificate data cannot be obtained from the supplied certificate object (error: %1). This occurs when CPackage::put_CertificateObject cannot instantiate the ManagedHelper object, when the ManagedHelper object fails, or when the ManagedHelper object returns a malformed array.

DTS_E_CANTGETCUSTOMPROPERTY DTS_E_CANTGETCUSTOMPROPERTY DTS_E_CANTGETCUSTOMPROPERTY

The custom property "%1" cannot be retrieved.

DTS_E_CANTGETCUSTOMPROPERTYCOLLECTION DTS_E_CANTGETCUSTOMPROPERTYCOLLECTION DTS_E_CANTGETCUSTOMPROPERTYCOLLECTION

The custom property collection cannot be retrieved for initialization.

DTS_E_CANTGETMUTEX DTS_E_CANTGETMUTEX DTS_E_CANTGETMUTEX

A thread failed to create a mutex at initialization.

DTS_E_CANTGETSEMAPHORE DTS_E_CANTGETSEMAPHORE DTS_E_CANTGETSEMAPHORE

A thread failed to create a semaphore at initialization.

DTS_E_CANTGIVEAWAYBUFFER DTS_E_CANTGIVEAWAYBUFFER DTS_E_CANTGIVEAWAYBUFFER

The Data Flow task engine attempted to copy a buffer to assign another thread, but failed.

DTS_E_CANTINITINPUT DTS_E_CANTINITINPUT DTS_E_CANTINITINPUT

An input cannot be created to initialize the inputs collection.

DTS_E_CANTINITOUTPUT DTS_E_CANTINITOUTPUT DTS_E_CANTINITOUTPUT

An output cannot be created to initialize the outputs collection.

DTS_E_CANTINSERTCOLUMNTYPE DTS_E_CANTINSERTCOLUMNTYPE DTS_E_CANTINSERTCOLUMNTYPE

The column "%1" cannot be inserted because the conversion between types %2 and %3 is not supported.

DTS_E_CANTINSERTINTOHASHTABLE DTS_E_CANTINSERTINTOHASHTABLE DTS_E_CANTINSERTINTOHASHTABLE

There is not enough memory to insert an object into the hash table.

DTS_E_CANTLOADFROMNODE DTS_E_CANTLOADFROMNODE DTS_E_CANTLOADFROMNODE

The runtime object cannot be loaded from the specified XML node. This happens when trying to load a package or other object from an XML node that is not of the correct type, such as a non-SSIS XML node.

DTS_E_CANTLOCKBUFFER DTS_E_CANTLOCKBUFFER DTS_E_CANTLOCKBUFFER

A buffer could not be locked. The system is out of memory or the buffer manager has reached its quota.

DTS_E_CANTMODIFYERROROUTPUTCOLUMNDATATYPE DTS_E_CANTMODIFYERROROUTPUTCOLUMNDATATYPE DTS_E_CANTMODIFYERROROUTPUTCOLUMNDATATYPE

The data type for "%1" cannot be modified in the error "%2".

DTS_E_CANTMODIFYINVALID DTS_E_CANTMODIFYINVALID DTS_E_CANTMODIFYINVALID

The component cannot perform the requested metadata change until the validation problem is fixed.

DTS_E_CANTOPENCERTSTORE DTS_E_CANTOPENCERTSTORE DTS_E_CANTOPENCERTSTORE

Opening MY certificate store failed with error "%1".This occurs in CPackage::LoadUserCertificateByName and CPackage::LoadUserCertificateByHash.

DTS_E_CANTPROCESSCOLUMNTYPECODEPAGE DTS_E_CANTPROCESSCOLUMNTYPECODEPAGE DTS_E_CANTPROCESSCOLUMNTYPECODEPAGE

The column "%1" cannot be processed because more than one code page (%2!d! and %3!d!) are specified for it.

DTS_E_CANTREALIZEVIRTUALBUFFERS DTS_E_CANTREALIZEVIRTUALBUFFERS DTS_E_CANTREALIZEVIRTUALBUFFERS

A set of virtual buffers cannot be realized.

DTS_E_CANTREGISTERBUFFERTYPE DTS_E_CANTREGISTERBUFFERTYPE DTS_E_CANTREGISTERBUFFERTYPE

The Data Flow task cannot register a buffer type. The type had %1!d! columns and was for execution tree %2!d!.

DTS_E_CANTREGISTERVIEWBUFFERTYPE DTS_E_CANTREGISTERVIEWBUFFERTYPE DTS_E_CANTREGISTERVIEWBUFFERTYPE

The Data Flow task cannot register a view buffer type. The type had %1!d! columns and was for input ID %2!d!.

DTS_E_CANTSETEXTERNALMETADATACOLUMNDATATYPEPROPERTIES DTS_E_CANTSETEXTERNALMETADATACOLUMNDATATYPEPROPERTIES DTS_E_CANTSETEXTERNALMETADATACOLUMNDATATYPEPROPERTIES

The %1 does not allow setting external metadata column data type properties.

DTS_E_CANTSETOUTPUTCOLUMNDATATYPEPROPERTIES DTS_E_CANTSETOUTPUTCOLUMNDATATYPEPROPERTIES DTS_E_CANTSETOUTPUTCOLUMNDATATYPEPROPERTIES

The %1 does not allow setting output column data type properties.

DTS_E_CANTSETOUTPUTCOLUMNPROPERTY DTS_E_CANTSETOUTPUTCOLUMNPROPERTY DTS_E_CANTSETOUTPUTCOLUMNPROPERTY

The property on an output column cannot be set.

DTS_E_CANTSETUSAGETYPE DTS_E_CANTSETUSAGETYPE DTS_E_CANTSETUSAGETYPE

The %1 has forbidden the requested use of the input column with lineage ID %2!d!.

DTS_E_CANTSETUSAGETYPETOREADWRITE DTS_E_CANTSETUSAGETYPETOREADWRITE DTS_E_CANTSETUSAGETYPETOREADWRITE

The "%1" is unable to make the column with lineage ID %2!d! read/write because that usage type is not allowed on this column. An attempt was made to change the usage type of an input column to a type, UT_READWRITE, that is not supported on this component.

DTS_E_CANTWRITETOFILE DTS_E_CANTWRITETOFILE DTS_E_CANTWRITETOFILE

The file, "%1", could not be opened for writing. The file could be read-only, or you do not have the correct permissions.

DTS_E_CERTERROR DTS_E_CERTERROR DTS_E_CERTERROR

There is an error processing the client certificate. This error can occur when the client certificate provided was not found in the Personal Certificate Store. Verify that the client certificate is valid.

DTS_E_CHANGESYSTEMVARIABLENAMEFAILED DTS_E_CHANGESYSTEMVARIABLENAMEFAILED DTS_E_CHANGESYSTEMVARIABLENAMEFAILED

Changing the name of a variable failed because it is a system variable. System variables are read-only.

DTS_E_CHANGESYSTEMVARIABLENAMESPACEFAILED DTS_E_CHANGESYSTEMVARIABLENAMESPACEFAILED DTS_E_CHANGESYSTEMVARIABLENAMESPACEFAILED

Changing the namespace of a variable failed because it is a system variable. System variables are read-only.

DTS_E_CHANGESYSTEMVARIABLEREADONLYFAILED DTS_E_CHANGESYSTEMVARIABLEREADONLYFAILED DTS_E_CHANGESYSTEMVARIABLEREADONLYFAILED

Changing the property of a variable failed because it is a system variable. System variables are read-only.

DTS_E_CHECKENVELOPEFAILED DTS_E_CHECKENVELOPEFAILED DTS_E_CHECKENVELOPEFAILED

Failed to check for XML signature envelope in package XML with error 0x%1!8.8X! "%2". This occurs in CPackage::LoadFromXML.

DTS_E_CHECKPOINTFILEALREADYEXISTS DTS_E_CHECKPOINTFILEALREADYEXISTS DTS_E_CHECKPOINTFILEALREADYEXISTS

An existing checkpoint file is found with contents that do not appear to be for this package, so the file cannot be overwritten to start saving new checkpoints. Remove the existing checkpoint file and try again. This error occurs when a checkpoint file exists, the package is set to not use a checkpoint file, but to save checkpoints. The existing checkpoint file will not be overwritten.

DTS_E_CHECKPOINTFILELOCKED DTS_E_CHECKPOINTFILELOCKED DTS_E_CHECKPOINTFILELOCKED

The checkpoint file "%1" is locked by another process. This may occur if another instance of this package is currently executing.

DTS_E_CHECKPOINTFILENOTSPECIFIED DTS_E_CHECKPOINTFILENOTSPECIFIED DTS_E_CHECKPOINTFILENOTSPECIFIED

The package is configured to always restart from a checkpoint, but checkpoint file is not specified.

DTS_E_CHECKPOINTLOADXML DTS_E_CHECKPOINTLOADXML DTS_E_CHECKPOINTLOADXML

The attempt to load the XML checkpoint file "%1" failed with error 0x%2!8.8X! "%3". Check that the file name specified is correct, and that the file exists.

DTS_E_CHECKPOINTMISMATCH DTS_E_CHECKPOINTMISMATCH DTS_E_CHECKPOINTMISMATCH

The checkpoint file "%1" does not match this package. The ID of the package and the ID in the checkpoint file do not match.

DTS_E_CLIENTAUTH DTS_E_CLIENTAUTH DTS_E_CLIENTAUTH

The client certificate is missing. This error occurs when the server is expecting an SSL client certificate and the user has provided an invalid certificate, or has not provided a certificate. A client certificate must be configured for this connection.

DTS_E_CMDDESTNOPARAMS DTS_E_CMDDESTNOPARAMS DTS_E_CMDDESTNOPARAMS

Unable to retrieve destination column descriptions from the parameters of the SQL command.

DTS_E_CMDDESTNOTBOUND DTS_E_CMDDESTNOTBOUND DTS_E_CMDDESTNOTBOUND

The parameters are not bound. All parameters in the SQL command must be bound to input columns.

DTS_E_CODE_PAGE_NOT_SUPPORTED DTS_E_CODE_PAGE_NOT_SUPPORTED DTS_E_CODE_PAGE_NOT_SUPPORTED

The code page %1!d! specified on column "%2" (%3!d!) is not supported. You must first convert this column to DT_WSTR which can be done by inserting a Data Conversion Transform before this one.

DTS_E_CODEPAGEREQUIRED DTS_E_CODEPAGEREQUIRED DTS_E_CODEPAGEREQUIRED

The "%1" requires a code page to be set but the value passed was zero.

DTS_E_COLLECTIONCOULDNTADD DTS_E_COLLECTIONCOULDNTADD DTS_E_COLLECTIONCOULDNTADD

An object was created but the attempt to add it to a collection failed. This can occur due to an out-of-memory condition.

DTS_E_COLLECTIONLOCKED DTS_E_COLLECTIONLOCKED DTS_E_COLLECTIONLOCKED

This collection cannot be modified during package validation or execution.

DTS_E_COLLOCKED DTS_E_COLLOCKED DTS_E_COLLOCKED

The "%1" collection cannot be modified during package validation or execution. "%2" cannot be added to the collection.

DTS_E_COLLOCKED_NO_CREATIONNAME DTS_E_COLLOCKED_NO_CREATIONNAME DTS_E_COLLOCKED_NO_CREATIONNAME

The collection cannot be modified if the created item has no name.

DTS_E_COLNOTMAPPEDTOCACHECOL DTS_E_COLNOTMAPPEDTOCACHECOL DTS_E_COLNOTMAPPEDTOCACHECOL

The __ is not mapped to valid cache column.

DTS_E_COLUMNDATAOVERFLOWDISKIOBUFFER DTS_E_COLUMNDATAOVERFLOWDISKIOBUFFER DTS_E_COLUMNDATAOVERFLOWDISKIOBUFFER

The column data for column "%1" overflowed the disk I/O buffer.

DTS_E_COLUMNDELIMITERNOTFOUND DTS_E_COLUMNDELIMITERNOTFOUND DTS_E_COLUMNDELIMITERNOTFOUND

The column delimiter for column "%1" was not found.

DTS_E_COLUMNMAPPEDTOALREADYMAPPEDEXTERNALMETADATACOLUMN DTS_E_COLUMNMAPPEDTOALREADYMAPPEDEXTERNALMETADATACOLUMN DTS_E_COLUMNMAPPEDTOALREADYMAPPEDEXTERNALMETADATACOLUMN

The %1 is mapped to the external metadata column with ID %2!ld!, which is already mapped to another column.

DTS_E_COLUMNMAPPEDTONONEXISTENTEXTERNALMETADATACOLUMN DTS_E_COLUMNMAPPEDTONONEXISTENTEXTERNALMETADATACOLUMN DTS_E_COLUMNMAPPEDTONONEXISTENTEXTERNALMETADATACOLUMN

The %1 is mapped to an external metadata column that does not exist.

DTS_E_COLUMNMETADATAUNAVAILABLEFORVALIDATION DTS_E_COLUMNMETADATAUNAVAILABLEFORVALIDATION DTS_E_COLUMNMETADATAUNAVAILABLEFORVALIDATION

The column metadata was unavailable for validation.

DTS_E_COLUMNNOTFOUND DTS_E_COLUMNNOTFOUND DTS_E_COLUMNNOTFOUND

The column "%1" cannot be found at the data source.

DTS_E_COLUMNNOTMAPPEDTOEXTERNALMETADATACOLUMN DTS_E_COLUMNNOTMAPPEDTOEXTERNALMETADATACOLUMN DTS_E_COLUMNNOTMAPPEDTOEXTERNALMETADATACOLUMN

The external metadata column mapping for %1 is not valid. The external metadata column ID cannot be zero.

DTS_E_COLUMNNOTMATCHED DTS_E_COLUMNNOTMATCHED DTS_E_COLUMNNOTMATCHED

The column "%1" (%2!d!) cannot be matched to any input file column. The output column name or input column name cannot be found in the file.

DTS_E_COLUMNPARSEFAILED DTS_E_COLUMNPARSEFAILED DTS_E_COLUMNPARSEFAILED

The column "%1" in the data filehas failed to parse.

DTS_E_COLUMNSHAVEINCOMPATIBLEMETADATA DTS_E_COLUMNSHAVEINCOMPATIBLEMETADATA DTS_E_COLUMNSHAVEINCOMPATIBLEMETADATA

The columns "%1" and "%2" have incompatible metadata.

DTS_E_COLUMNSTATUSERROR DTS_E_COLUMNSTATUSERROR DTS_E_COLUMNSTATUSERROR

There was an error with %1 on %2. The column status returned was: "%3".

DTS_E_COMERROR DTS_E_COMERROR DTS_E_COMERROR

The COM error object information is available. Source: "%1" error code: 0x%2!8.8X! Description: "%3".

DTS_E_COMMANDDESTINATIONADAPTERSTATIC_CANTCONVERTVALUE DTS_E_COMMANDDESTINATIONADAPTERSTATIC_CANTCONVERTVALUE DTS_E_COMMANDDESTINATIONADAPTERSTATIC_CANTCONVERTVALUE

The data value cannot be converted for reasons other than sign mismatch or data overflow.

DTS_E_COMMANDDESTINATIONADAPTERSTATIC_DATAOVERFLOW DTS_E_COMMANDDESTINATIONADAPTERSTATIC_DATAOVERFLOW DTS_E_COMMANDDESTINATIONADAPTERSTATIC_DATAOVERFLOW

The conversion failed because the data value overflowed the type used by the provider.

DTS_E_COMMANDDESTINATIONADAPTERSTATIC_ERRORSINCOMMAND DTS_E_COMMANDDESTINATIONADAPTERSTATIC_ERRORSINCOMMAND DTS_E_COMMANDDESTINATIONADAPTERSTATIC_ERRORSINCOMMAND

The command execution generated errors.

DTS_E_COMMANDDESTINATIONADAPTERSTATIC_INTEGRITYVIOLATION DTS_E_COMMANDDESTINATIONADAPTERSTATIC_INTEGRITYVIOLATION DTS_E_COMMANDDESTINATIONADAPTERSTATIC_INTEGRITYVIOLATION

The data value violated the integrity constraints for the column.

DTS_E_COMMANDDESTINATIONADAPTERSTATIC_PERMISSIONDENIED DTS_E_COMMANDDESTINATIONADAPTERSTATIC_PERMISSIONDENIED DTS_E_COMMANDDESTINATIONADAPTERSTATIC_PERMISSIONDENIED

The user did not have the correct permissions to write to the column.

DTS_E_COMMANDDESTINATIONADAPTERSTATIC_SCHEMAVIOLATION DTS_E_COMMANDDESTINATIONADAPTERSTATIC_SCHEMAVIOLATION DTS_E_COMMANDDESTINATIONADAPTERSTATIC_SCHEMAVIOLATION

The data value violated the schema constraint.

DTS_E_COMMANDDESTINATIONADAPTERSTATIC_SIGNMISMATCH DTS_E_COMMANDDESTINATIONADAPTERSTATIC_SIGNMISMATCH DTS_E_COMMANDDESTINATIONADAPTERSTATIC_SIGNMISMATCH

The conversion failed because the data value was signed and the type used by the provider was unsigned.

DTS_E_COMMANDDESTINATIONADAPTERSTATIC_TRUNCATED DTS_E_COMMANDDESTINATIONADAPTERSTATIC_TRUNCATED DTS_E_COMMANDDESTINATIONADAPTERSTATIC_TRUNCATED

The data was truncated.

DTS_E_COMMANDDESTINATIONADAPTERSTATIC_UNAVAILABLE DTS_E_COMMANDDESTINATIONADAPTERSTATIC_UNAVAILABLE DTS_E_COMMANDDESTINATIONADAPTERSTATIC_UNAVAILABLE

No status is available.

DTS_E_COMMITFAILED DTS_E_COMMITFAILED DTS_E_COMMITFAILED

A commit failed.

DTS_E_COMMITTRANSACTION DTS_E_COMMITTRANSACTION DTS_E_COMMITTRANSACTION

Commits a transaction.

DTS_E_COMPFLAGSONLYONSORTCOL DTS_E_COMPFLAGSONLYONSORTCOL DTS_E_COMPFLAGSONLYONSORTCOL

The "%1" cannot have a ComparisonFlags property set to non-zero because its SortKeyPosition is set to zero. An output column's ComparisonFlags can only be non-zero if its SortKeyPosition is also non-zero.

DTS_E_COMPONENT_NOINTERFACE DTS_E_COMPONENT_NOINTERFACE DTS_E_COMPONENT_NOINTERFACE

The %1 was found, but it does not support a required Integration Services interface (IDTSRuntimeComponent100). Obtain an updated version of this component from the component provider.

DTS_E_COMPONENTHASINVALIDCLSID DTS_E_COMPONENTHASINVALIDCLSID DTS_E_COMPONENTHASINVALIDCLSID

The CLSID for one of the components with ID %1!d! is not valid.

DTS_E_COMPONENTINITFAILED DTS_E_COMPONENTINITFAILED DTS_E_COMPONENTINITFAILED

The component initialization failed.

DTS_E_COMPONENTNOTFOUND DTS_E_COMPONENTNOTFOUND DTS_E_COMPONENTNOTFOUND

The module containing "%1" cannot be located, even though it is registered.

DTS_E_COMPONENTNOTREGISTERED DTS_E_COMPONENTNOTREGISTERED DTS_E_COMPONENTNOTREGISTERED

The module containing "%1" is not registered or installed correctly.

DTS_E_COMPONENTVERSIONMISMATCH DTS_E_COMPONENTVERSIONMISMATCH DTS_E_COMPONENTVERSIONMISMATCH

The version of %1 is not compatible with this version of the DataFlow.

DTS_E_COMPONENTVIEWISUNAVAILABLE DTS_E_COMPONENTVIEWISUNAVAILABLE DTS_E_COMPONENTVIEWISUNAVAILABLE

The component view is unavailable. Make sure the component view has been created.

DTS_E_CONFIGFAILED DTS_E_CONFIGFAILED DTS_E_CONFIGFAILED

The configuration failed. This is a generic warning for all configuration types. Other warnings should precede this with more information.

DTS_E_CONFIGFILEFAILEDEXPORT DTS_E_CONFIGFILEFAILEDEXPORT DTS_E_CONFIGFILEFAILEDEXPORT

Failure exporting configuration file.

DTS_E_CONFIGFORMATINVALID DTS_E_CONFIGFORMATINVALID DTS_E_CONFIGFORMATINVALID

The configuration entry "%1" had an incorrect format. This can occur because of a missing delimiter or formatting errors, like an invalid array delimiter.

DTS_E_CONFIGFORMATINVALID_PACKAGEDELIMITER DTS_E_CONFIGFORMATINVALID_PACKAGEDELIMITER DTS_E_CONFIGFORMATINVALID_PACKAGEDELIMITER

The configuration entry, "%1", has an incorrect format because it does not begin with package delimiter. There was no "\package" delimiter.

DTS_E_CONFIGTYPECONVERSIONFAILED DTS_E_CONFIGTYPECONVERSIONFAILED DTS_E_CONFIGTYPECONVERSIONFAILED

A type in the configuration "%1" for the package path "%2" failed to convert. This happens when a configuration value cannot be converted from a string to the appropriate destination type. Check the configuration value to ensure it can be converted to the type of the destination property or variable.

DTS_E_CONNECTIONMANAGERCOLUMNCOUNTMISMATCH DTS_E_CONNECTIONMANAGERCOLUMNCOUNTMISMATCH DTS_E_CONNECTIONMANAGERCOLUMNCOUNTMISMATCH

The number of columns in the flat file connection manager must be the same as the number of columns in the flat file adapter. The number of columns for the flat file connection manager is %1!d!, while the number of columns for the flat file adapter is %2!d!.

DTS_E_CONNECTIONMANAGERJOINTRANSACTION DTS_E_CONNECTIONMANAGERJOINTRANSACTION DTS_E_CONNECTIONMANAGERJOINTRANSACTION

The connection manager failed to defect from the transaction.

DTS_E_CONNECTIONMANAGERNOTFOUND DTS_E_CONNECTIONMANAGERNOTFOUND DTS_E_CONNECTIONMANAGERNOTFOUND

The connection manager "%1" is not found. A component failed to find the connection manager in the Connections collection.

DTS_E_CONNECTIONMANAGERQUALIFIERALREADYSET DTS_E_CONNECTIONMANAGERQUALIFIERALREADYSET DTS_E_CONNECTIONMANAGERQUALIFIERALREADYSET

The qualifier is already set on this instance of the connection manager. The qualifier may be set once per instance.

DTS_E_CONNECTIONMANAGERQUALIFIERNOTSET DTS_E_CONNECTIONMANAGERQUALIFIERNOTSET DTS_E_CONNECTIONMANAGERQUALIFIERNOTSET

The qualifier has not been set on this instance of the connection manager. Setting the qualifier is required to complete initialization.

DTS_E_CONNECTIONMANAGERQUALIFIERNOTSUPPORTED DTS_E_CONNECTIONMANAGERQUALIFIERNOTSUPPORTED DTS_E_CONNECTIONMANAGERQUALIFIERNOTSUPPORTED

This connection manager does not support specification of qualifiers.

DTS_E_CONNECTIONMANAGERTRANSACTEDANDRETAINEDINBULKINSERT DTS_E_CONNECTIONMANAGERTRANSACTEDANDRETAINEDINBULKINSERT DTS_E_CONNECTIONMANAGERTRANSACTEDANDRETAINEDINBULKINSERT

The component cannot use a connection manager that retains its connection in a transaction with fastload or bulk insert.

DTS_E_CONNECTIONMANANGERNOTASSIGNED DTS_E_CONNECTIONMANANGERNOTASSIGNED DTS_E_CONNECTIONMANANGERNOTASSIGNED

A connection manager has not been assigned to the %1.

DTS_E_CONNECTIONNOTFOUND DTS_E_CONNECTIONNOTFOUND DTS_E_CONNECTIONNOTFOUND

The connection "%1" is not found. This error is thrown by Connections collection when the specific connection element is not found.

DTS_E_CONNECTIONOFFLINE DTS_E_CONNECTIONOFFLINE DTS_E_CONNECTIONOFFLINE

The connection manager "%1" will not acquire a connection because the package OfflineMode property is TRUE. When the OfflineMode is TRUE, connections cannot be acquired.

DTS_E_CONNECTIONREQUIREDFORMETADATA DTS_E_CONNECTIONREQUIREDFORMETADATA DTS_E_CONNECTIONREQUIREDFORMETADATA

An error occurred due to no connection. A connection is required when requesting metadata. If you are working offline, uncheck Work Offline on the SSIS menu to enable the connection.

DTS_E_CONNECTIONREQUIREDFORREAD DTS_E_CONNECTIONREQUIREDFORREAD DTS_E_CONNECTIONREQUIREDFORREAD

A connection is required to read data.

DTS_E_CONNECTIONSTRING DTS_E_CONNECTIONSTRING DTS_E_CONNECTIONSTRING

The OLE DB has failed making a database connection when using the supplied connection string.

DTS_E_CONNECTIONSTRINGFORMAT DTS_E_CONNECTIONSTRINGFORMAT DTS_E_CONNECTIONSTRINGFORMAT

The connection string format is not valid. It must consist of one or more components of the form X=Y, separated by semicolons. This error occurs when a connection string with zero components is set on database connection manager.

DTS_E_CONNECTIONTERMINATED DTS_E_CONNECTIONTERMINATED DTS_E_CONNECTIONTERMINATED

The connection with the server has been reset or terminated. Try again later.

DTS_E_CONNECTIONVALIDATIONFAILED DTS_E_CONNECTIONVALIDATIONFAILED DTS_E_CONNECTIONVALIDATIONFAILED

The connection "%1" failed validation.

DTS_E_CONNECTREQUIREDFORMETADATAVALIDATION DTS_E_CONNECTREQUIREDFORMETADATAVALIDATION DTS_E_CONNECTREQUIREDFORMETADATAVALIDATION

There is an error due to no connection. A connection is required before metadata validation can proceed.

DTS_E_CONNECTTOSERVERFAILED DTS_E_CONNECTTOSERVERFAILED DTS_E_CONNECTTOSERVERFAILED

A connect to SSIS Service on machine "%1" failed: %2.

DTS_E_CONNECTTOSERVERFAILED_ACCESSDENIED DTS_E_CONNECTTOSERVERFAILED_ACCESSDENIED DTS_E_CONNECTTOSERVERFAILED_ACCESSDENIED

A connect to server failed. Access denied.

DTS_E_CONNECTTOSERVERFAILED_NOTREGISTERED DTS_E_CONNECTTOSERVERFAILED_NOTREGISTERED DTS_E_CONNECTTOSERVERFAILED_NOTREGISTERED

A connect to server failed. The server is not registered.

DTS_E_CONNECTTOSERVERFAILED_UNAVAILABLE DTS_E_CONNECTTOSERVERFAILED_UNAVAILABLE DTS_E_CONNECTTOSERVERFAILED_UNAVAILABLE

A connect to server failed. Server is unavailable.

DTS_E_COULD_NOT_DETERMINE_DATASOURCE_DBMSNAME DTS_E_COULD_NOT_DETERMINE_DATASOURCE_DBMSNAME DTS_E_COULD_NOT_DETERMINE_DATASOURCE_DBMSNAME

Unable to determine the DBMS name and version on "%1". This occurs if the IDBProperties on the connection did not return information needed to verify the DBMS name and version.

DTS_E_COULDNOTCREATECOPYBUFFER DTS_E_COULDNOTCREATECOPYBUFFER DTS_E_COULDNOTCREATECOPYBUFFER

The %1 cannot create a buffer to copy its data into for sorting.

DTS_E_COULDNOTFINDINPUTBUFFERCOLUMNBYLINEAGE DTS_E_COULDNOTFINDINPUTBUFFERCOLUMNBYLINEAGE DTS_E_COULDNOTFINDINPUTBUFFERCOLUMNBYLINEAGE

The %1 cannot find the column with LineageID %2!ld! in its input buffer.

DTS_E_COULDNOTGETCOLUMNINFOFORCOPYBUFFER DTS_E_COULDNOTGETCOLUMNINFOFORCOPYBUFFER DTS_E_COULDNOTGETCOLUMNINFOFORCOPYBUFFER

The %1 cannot get the column information for column "%2!lu!" from its copy buffer.

DTS_E_COULDNOTGETCOLUMNINFOFORINPUTBUFFER DTS_E_COULDNOTGETCOLUMNINFOFORINPUTBUFFER DTS_E_COULDNOTGETCOLUMNINFOFORINPUTBUFFER

The %1 cannot get the column information for column %2!lu! from its input buffer.

DTS_E_COULDNOTREGISTERCOPYBUFFER DTS_E_COULDNOTREGISTERCOPYBUFFER DTS_E_COULDNOTREGISTERCOPYBUFFER

The %1 cannot register a buffer type for its copy buffer.

DTS_E_COULDNOTREPLACECHECKPOINTFILE DTS_E_COULDNOTREPLACECHECKPOINTFILE DTS_E_COULDNOTREPLACECHECKPOINTFILE

The existing checkpoint file cannot be replaced with the updated checkpoint file. The checkpoint was successfully created in a temporary file, but overwriting the existing file with the new file failed.

DTS_E_COULDNOTRESOLVEPACKAGEPATH DTS_E_COULDNOTRESOLVEPACKAGEPATH DTS_E_COULDNOTRESOLVEPACKAGEPATH

A package path cannot be resolved to an object in the package "%1". Verify that the package path is valid.

DTS_E_CREATECHECKPOINTFILE DTS_E_CREATECHECKPOINTFILE DTS_E_CREATECHECKPOINTFILE

Checkpoint file "%1" failed during creation due to error 0x%2!8.8X! "%3".

DTS_E_CREATEEXPRESSIONOBJECTFAILED DTS_E_CREATEEXPRESSIONOBJECTFAILED DTS_E_CREATEEXPRESSIONOBJECTFAILED

The memory cannot be allocated for the expression "%1". There was an out-of-memory error while creating an internal object to hold the expression.

DTS_E_CREATEFOLDERONSQLSERVER_OLEDB DTS_E_CREATEFOLDERONSQLSERVER_OLEDB DTS_E_CREATEFOLDERONSQLSERVER_OLEDB

The CreateFolderOnSQLServer method has encountered OLE DB error code 0x%1!8.8X! (%2) The SQL statement issued has failed.

DTS_E_CREATEMANAGEDHELPERFAILED DTS_E_CREATEMANAGEDHELPERFAILED DTS_E_CREATEMANAGEDHELPERFAILED

The SSIS managed helper object failed during creation with error 0x%1!8.8X! "%2". This occurs whenever CoCreateInstanceCLSID_DTSManagedHelper fails.

DTS_E_CUSTOMEVENTCONFLICT DTS_E_CUSTOMEVENTCONFLICT DTS_E_CUSTOMEVENTCONFLICT

The custom event "%1" is already declared with a different parameter list. A task is trying to declare a custom event, which another task has already declared with a different parameter list.

DTS_E_CUSTOMPROPERTYISREADONLY DTS_E_CUSTOMPROPERTYISREADONLY DTS_E_CUSTOMPROPERTYISREADONLY

The value of custom property "%1" on the %2 cannot be changed.

DTS_E_CYCLEINEXECUTIONTREE DTS_E_CYCLEINEXECUTIONTREE DTS_E_CYCLEINEXECUTIONTREE

An execution tree contains a cycle.

DTS_E_DANGLINGWITHPATH DTS_E_DANGLINGWITHPATH DTS_E_DANGLINGWITHPATH

The %1 is marked as dangling, but has a path attached to it.

DTS_E_DATACONVERSIONFAILED DTS_E_DATACONVERSIONFAILED DTS_E_DATACONVERSIONFAILED

The data conversion failed while converting column "%1" (%2!d!) to column "%3" (%4!d!). The conversion returned status value %5!d! and status text "%6".

DTS_E_DATAREADERDESTCANNOTCONVERT DTS_E_DATAREADERDESTCANNOTCONVERT DTS_E_DATAREADERDESTCANNOTCONVERT

The %1 from data type "%2" cannot be converted to data type "%3".

DTS_E_DATAREADERDESTDATATYPENOTSUPPORTED DTS_E_DATAREADERDESTDATATYPENOTSUPPORTED DTS_E_DATAREADERDESTDATATYPENOTSUPPORTED

The data type "" found on is not supported for the __.

DTS_E_DATAREADERDESTINVALIDCODEPAGE DTS_E_DATAREADERDESTINVALIDCODEPAGE DTS_E_DATAREADERDESTINVALIDCODEPAGE

The %1 has unsupported code page %2!d!.

DTS_E_DATAREADERDESTINVALIDCOLUMNORDINAL DTS_E_DATAREADERDESTINVALIDCOLUMNORDINAL DTS_E_DATAREADERDESTINVALIDCOLUMNORDINAL

The ordinal position of the column is not valid.

DTS_E_DATAREADERDESTREADERISATEND DTS_E_DATAREADERDESTREADERISATEND DTS_E_DATAREADERDESTREADERISATEND

The SSIS IDataReader is past the end of the result set.

DTS_E_DATAREADERDESTREADERISCLOSED DTS_E_DATAREADERDESTREADERISCLOSED DTS_E_DATAREADERDESTREADERISCLOSED

The SSIS IDataReader is closed.

DTS_E_DATAREADERDESTREADERTIMEOUT DTS_E_DATAREADERDESTREADERTIMEOUT DTS_E_DATAREADERDESTREADERTIMEOUT

The SSIS IDataReader is closed. The read timeout has expired.

DTS_E_DATAREADERDESTREADFAILED DTS_E_DATAREADERDESTREADFAILED DTS_E_DATAREADERDESTREADFAILED

The DataReader client has failed to call Read or has closed the DataReader.

DTS_E_DATAREADERDESTUNABLETOPROCESSDATA DTS_E_DATAREADERDESTUNABLETOPROCESSDATA DTS_E_DATAREADERDESTUNABLETOPROCESSDATA

The %1 was unable to process the data.

DTS_E_DATAREADERSRCUNABLETOPROCESSDATA DTS_E_DATAREADERSRCUNABLETOPROCESSDATA DTS_E_DATAREADERSRCUNABLETOPROCESSDATA

The %1 was unable to process the data.

DTS_E_DATASOURCECOLUMNWITHNONAMEFOUND DTS_E_DATASOURCECOLUMNWITHNONAMEFOUND DTS_E_DATASOURCECOLUMNWITHNONAMEFOUND

There is a data source column with no name. Each data source column must have a name.

DTS_E_DATATAP_CREATEFILEFAILURE DTS_E_DATATAP_CREATEFILEFAILURE DTS_E_DATATAP_CREATEFILEFAILURE

The DATATAP file failed to create.

DTS_E_DATATAP_DUPLICATE DTS_E_DATATAP_DUPLICATE DTS_E_DATATAP_DUPLICATE

Duplicates the DATATAP.

DTS_E_DATATAP_FAILTOAPPLYCONFIGURATION DTS_E_DATATAP_FAILTOAPPLYCONFIGURATION DTS_E_DATATAP_FAILTOAPPLYCONFIGURATION

The configuration on the DATATAP failed to apply.

DTS_E_DATATAP_INVALIDFILENAME DTS_E_DATATAP_INVALIDFILENAME DTS_E_DATATAP_INVALIDFILENAME

The file name is invalid.

DTS_E_DATATAP_INVALIDPATH DTS_E_DATATAP_INVALIDPATH DTS_E_DATATAP_INVALIDPATH

The DATATAP has invalid path.

DTS_E_DATATAP_NOTAPLOCATION DTS_E_DATATAP_NOTAPLOCATION DTS_E_DATATAP_NOTAPLOCATION

There is no DATATAP application.

DTS_E_DATATAP_READONLY DTS_E_DATATAP_READONLY DTS_E_DATATAP_READONLY

The DATATAP is read only.

DTS_E_DATATAPFAILED DTS_E_DATATAPFAILED DTS_E_DATATAPFAILED

The DATATAP has failed.

DTS_E_DECRYPTPACKAGE_USERKEY DTS_E_DECRYPTPACKAGE_USERKEY DTS_E_DECRYPTPACKAGE_USERKEY

A package that is encrypted with a user key failed to decrypt. You may not be the user who encrypted this package, or you are not using the same machine that was used to save the package.

DTS_E_DECRYPTPROJECT_PASSWORD DTS_E_DECRYPTPROJECT_PASSWORD DTS_E_DECRYPTPROJECT_PASSWORD

A project that is encrypted with a password failed to decrypt.

DTS_E_DECRYPTPROJECT_USERKEY DTS_E_DECRYPTPROJECT_USERKEY DTS_E_DECRYPTPROJECT_USERKEY

A project that is encrypted with a user key failed to decrypt.

DTS_E_DECRYPTXML_PASSWORD DTS_E_DECRYPTXML_PASSWORD DTS_E_DECRYPTXML_PASSWORD

An encrypted XML node failed to decrypt because the password was not specified or not correct. Package load will attempt to continue without the encrypted information.

DTS_E_DEPRECATEDTASK DTS_E_DEPRECATEDTASK DTS_E_DEPRECATEDTASK

The task is deprecated.

DTS_E_DERIVEDRESULT_TOO_LONG DTS_E_DERIVEDRESULT_TOO_LONG DTS_E_DERIVEDRESULT_TOO_LONG

The transform encountered a result value that was longer than %1!u! bytes.

DTS_E_DESTINATIONFLATFILEREQUIRED DTS_E_DESTINATIONFLATFILEREQUIRED DTS_E_DESTINATIONFLATFILEREQUIRED

The destination flat file name was not provided. Make sure the flat file connection manager is configured with a connection string. If the flat file connection manager is used by multiple components, ensure that the connection string contains enough file names.

DTS_E_DESTINATIONOBJECTPARENTLESS DTS_E_DESTINATIONOBJECTPARENTLESS DTS_E_DESTINATIONOBJECTPARENTLESS

The destination object in a property mapping has no parent. The destination object is not a child of any sequence container. It may have been removed from the package.

DTS_E_DESTINATIONTABLENAMENOTPROVIDED DTS_E_DESTINATIONTABLENAMENOTPROVIDED DTS_E_DESTINATIONTABLENAMENOTPROVIDED

A destination table name has not been provided.

DTS_E_DIRECTTONONERROROUTPUT DTS_E_DIRECTTONONERROROUTPUT DTS_E_DIRECTTONONERROROUTPUT

The buffer manager attempted to push an error row to an output that was not registered as an error output. There was a call to DirectErrorRow on an output that does not have the IsErrorOut property set to TRUE.

DTS_E_DISCONNECTEDCOMPONENT DTS_E_DISCONNECTEDCOMPONENT DTS_E_DISCONNECTEDCOMPONENT

A component is disconnected from the layout.

DTS_E_DISCONNECTEDOBJECT DTS_E_DISCONNECTEDOBJECT DTS_E_DISCONNECTEDOBJECT

The %1 object "%2" (%3!d!) is disconnected from the layout.

DTS_E_DISCONNECTEDPATH DTS_E_DISCONNECTEDPATH DTS_E_DISCONNECTEDPATH

The path is disconnected from the path.

DTS_E_DISKIOBUFFEROVERFLOW DTS_E_DISKIOBUFFEROVERFLOW DTS_E_DISKIOBUFFEROVERFLOW

The attempt to write data of %1!d! bytes into the disk I/O failed. The disk I/O buffer has %2!d! free bytes.

DTS_E_DISKIOFAILED DTS_E_DISKIOFAILED DTS_E_DISKIOFAILED

An unexpected disk I/O error occurred while reading the file.

DTS_E_DISKIOTIMEDOUT DTS_E_DISKIOTIMEDOUT DTS_E_DISKIOTIMEDOUT

An disk I/O time out occurred while reading the file.

DTS_E_DISPENSEDREADONLY DTS_E_DISPENSEDREADONLY DTS_E_DISPENSEDREADONLY

The Variables collection was returned the from VariableDispenser and cannot be modified. Items cannot be added to or removed from dispensed collections.

DTS_E_DISTRIBUTORADDFAILED DTS_E_DISTRIBUTORADDFAILED DTS_E_DISTRIBUTORADDFAILED

A distributor failed to give a buffer to thread "%1" because of error 0x%2!8.8X!. The target thread is probably shutting down.

DTS_E_DISTRIBUTORCANTSETPROPERTY DTS_E_DISTRIBUTORCANTSETPROPERTY DTS_E_DISTRIBUTORCANTSETPROPERTY

The distributor for thread "%1" failed to initialize property "%2" on component "%3" because of error 0x%8.8X. The distributor could not initialize the component's property and cannot continue running.

DTS_E_DOESNOTSUPPORTTRANSACTIONS DTS_E_DOESNOTSUPPORTTRANSACTIONS DTS_E_DOESNOTSUPPORTTRANSACTIONS

The enlisting in transactions is not supported.

DTS_E_DOWNGRADEFAILED DTS_E_DOWNGRADEFAILED DTS_E_DOWNGRADEFAILED

MessageId: DTS_E_DOWNGRADEFAILED MessageText: The component metadata for "%1!s!" could not be downgraded to the older version of the component. The PerformDowngrade method failed.

DTS_E_DTPMISSINGATTRIBUTE DTS_E_DTPMISSINGATTRIBUTE DTS_E_DTPMISSINGATTRIBUTE

The required attribute is missing.

DTS_E_DTPMISSINGELEMENT DTS_E_DTPMISSINGELEMENT DTS_E_DTPMISSINGELEMENT

The required element is missing.

DTS_E_DTPXMLBOOLCONVERTERR DTS_E_DTPXMLBOOLCONVERTERR DTS_E_DTPXMLBOOLCONVERTERR

The value "%1" cannot be converted to a Boolean.

DTS_E_DTPXMLCANTREADIDATTR DTS_E_DTPXMLCANTREADIDATTR DTS_E_DTPXMLCANTREADIDATTR

The ID attribute cannot be read.

DTS_E_DTPXMLCONNECTIONLOADERR DTS_E_DTPXMLCONNECTIONLOADERR DTS_E_DTPXMLCONNECTIONLOADERR

There is an error setting connection object during XML load.

DTS_E_DTPXMLDATATYPEERR DTS_E_DTPXMLDATATYPEERR DTS_E_DTPXMLDATATYPEERR

The value "%1" is not valid for the attribute "%2".

DTS_E_DTPXMLDOMCREATEERROR DTS_E_DTPXMLDOMCREATEERROR DTS_E_DTPXMLDOMCREATEERROR

The XML DOM document cannot be instantiated.Please verify that MSXML binaries are properly installed and registered.

DTS_E_DTPXMLDOMLOADERROR DTS_E_DTPXMLDOMLOADERROR DTS_E_DTPXMLDOMLOADERROR

The XML data cannot be loaded into a local DOM for processing.

DTS_E_DTPXMLEVENTSCACHEERR DTS_E_DTPXMLEVENTSCACHEERR DTS_E_DTPXMLEVENTSCACHEERR

The Events Interface cannot be acquired. An invalid Events interface was passed to the data flow module for persisting to XML.

DTS_E_DTPXMLIDLOOKUPERR DTS_E_DTPXMLIDLOOKUPERR DTS_E_DTPXMLIDLOOKUPERR

The referenced object with ID %1!d! not found in package.

DTS_E_DTPXMLINPUTCOLUMNLOADERR DTS_E_DTPXMLINPUTCOLUMNLOADERR DTS_E_DTPXMLINPUTCOLUMNLOADERR

There is an error setting input column object during XML load.

DTS_E_DTPXMLINPUTLOADERR DTS_E_DTPXMLINPUTLOADERR DTS_E_DTPXMLINPUTLOADERR

There is an error setting input object during XML load.

DTS_E_DTPXMLINT32CONVERTERR DTS_E_DTPXMLINT32CONVERTERR DTS_E_DTPXMLINT32CONVERTERR

The value "%1" cannot be converted to an integer.

DTS_E_DTPXMLINVALIDPROPERTYARRAYNOTENOUGHVALUES DTS_E_DTPXMLINVALIDPROPERTYARRAYNOTENOUGHVALUES DTS_E_DTPXMLINVALIDPROPERTYARRAYNOTENOUGHVALUES

Too few array elements were found when parsing a property of type array. The element count is more than the number of array elements found.

DTS_E_DTPXMLINVALIDPROPERTYARRAYTOOMANYVALUES DTS_E_DTPXMLINVALIDPROPERTYARRAYTOOMANYVALUES DTS_E_DTPXMLINVALIDPROPERTYARRAYTOOMANYVALUES

Too many array elements were found when parsing a property of type array. The element count is less than the number of array elements found.

DTS_E_DTPXMLINVALIDXMLPERSISTPROPERTY DTS_E_DTPXMLINVALIDXMLPERSISTPROPERTY DTS_E_DTPXMLINVALIDXMLPERSISTPROPERTY

Apersistence property required for the pipelineXML module cannot be read. The property was not provided by the pipeline.

DTS_E_DTPXMLLOADFAILURE DTS_E_DTPXMLLOADFAILURE DTS_E_DTPXMLLOADFAILURE

Unable to load from XML.

DTS_E_DTPXMLOUTPUTCOLUMNLOADERR DTS_E_DTPXMLOUTPUTCOLUMNLOADERR DTS_E_DTPXMLOUTPUTCOLUMNLOADERR

There is an error setting output column object during XML load.

DTS_E_DTPXMLOUTPUTLOADERR DTS_E_DTPXMLOUTPUTLOADERR DTS_E_DTPXMLOUTPUTLOADERR

There is an error setting output object during XML load.

DTS_E_DTPXMLPARSEERRORNEARID DTS_E_DTPXMLPARSEERRORNEARID DTS_E_DTPXMLPARSEERRORNEARID

A load error encountered near object with ID %1!d!.

DTS_E_DTPXMLPATHLOADERR DTS_E_DTPXMLPATHLOADERR DTS_E_DTPXMLPATHLOADERR

An error occurred while setting a path object during XML load.

DTS_E_DTPXMLPROPERTYLOADERR DTS_E_DTPXMLPROPERTYLOADERR DTS_E_DTPXMLPROPERTYLOADERR

There is an error setting property object during XML load.

DTS_E_DTPXMLPROPERTYSTATEERR DTS_E_DTPXMLPROPERTYSTATEERR DTS_E_DTPXMLPROPERTYSTATEERR

The value "%1" is not valid for the attribute "%2".

DTS_E_DTPXMLPROPERTYTYPEERR DTS_E_DTPXMLPROPERTYTYPEERR DTS_E_DTPXMLPROPERTYTYPEERR

The value "%1" is not valid for the attribute "%2".

DTS_E_DTPXMLSAVEFAILURE DTS_E_DTPXMLSAVEFAILURE DTS_E_DTPXMLSAVEFAILURE

Unable to save to XML.

DTS_E_DTPXMLSETUSAGETYPEERR DTS_E_DTPXMLSETUSAGETYPEERR DTS_E_DTPXMLSETUSAGETYPEERR

The value "%1" is not valid for the attribute "%2".

DTS_E_DTRXMLSAVEFAILURE DTS_E_DTRXMLSAVEFAILURE DTS_E_DTRXMLSAVEFAILURE

The configuration file cannot be saved. The file may be read only.

DTS_E_DTS_E_FTPTASK_CANNOT_ACQUIRE_CONNECTION DTS_E_DTS_E_FTPTASK_CANNOT_ACQUIRE_CONNECTION DTS_E_DTS_E_FTPTASK_CANNOT_ACQUIRE_CONNECTION

There was an error acquiring the FTP connection. Please check if you have specified a valid connection type "%1".

DTS_E_DTSNAME_ALPHADIGITUNDERBAR DTS_E_DTSNAME_ALPHADIGITUNDERBAR DTS_E_DTSNAME_ALPHADIGITUNDERBAR

The object name "%1" is not valid. Name must contain only alphanumeric characters or underscores "_".

DTS_E_DTSNAME_BEGINSWITHALPHA DTS_E_DTSNAME_BEGINSWITHALPHA DTS_E_DTSNAME_BEGINSWITHALPHA

The object name "%1" is not valid. Name must begin with an alphabetical character.

DTS_E_DTSNAME_BEGINSWITHALPHAUNDERBAR DTS_E_DTSNAME_BEGINSWITHALPHAUNDERBAR DTS_E_DTSNAME_BEGINSWITHALPHAUNDERBAR

The object name "%1" is not valid. Name must begin with an alphabetical character or underscore "_".

DTS_E_DTSNAME_LEGAL DTS_E_DTSNAME_LEGAL DTS_E_DTSNAME_LEGAL

The object name "%1" is not valid. The name cannot contain any of the following characters: / \ : [ ] . =

DTS_E_DTSNAME_NOLEADWHITESP DTS_E_DTSNAME_NOLEADWHITESP DTS_E_DTSNAME_NOLEADWHITESP

The object name "%1" is not valid. Name cannot begin with a whitespace.

DTS_E_DTSNAME_NOTEMPTY DTS_E_DTSNAME_NOTEMPTY DTS_E_DTSNAME_NOTEMPTY

The object name is not valid. The name cannot be empty.

DTS_E_DTSNAME_NOTNULL DTS_E_DTSNAME_NOTNULL DTS_E_DTSNAME_NOTNULL

The object name is not valid. The name cannot be set to NULL.

DTS_E_DTSNAME_NOTRAILWHITESP DTS_E_DTSNAME_NOTRAILWHITESP DTS_E_DTSNAME_NOTRAILWHITESP

The object name "%1" is not valid. A name cannot end with a whitespace.

DTS_E_DTSNAME_PRINTABLE DTS_E_DTSNAME_PRINTABLE DTS_E_DTSNAME_PRINTABLE

The object name "%1" is not valid. The name cannot contain control characters that render it unprintable.

DTS_E_DTSNAME_TOOLONG DTS_E_DTSNAME_TOOLONG DTS_E_DTSNAME_TOOLONG

The object name is not valid. The name is too long.

DTS_E_DTSNAME_VALIDFILENAME DTS_E_DTSNAME_VALIDFILENAME DTS_E_DTSNAME_VALIDFILENAME

The object name "%1" is not valid. The name cannot contain any of the following characters: / \ : ? " < > |

DTS_E_DTSPROCTASK_CANNOTWRITEINAREADONLYVARIABLE DTS_E_DTSPROCTASK_CANNOTWRITEINAREADONLYVARIABLE DTS_E_DTSPROCTASK_CANNOTWRITEINAREADONLYVARIABLE

The Execution result cannot be saved in a read-only variable.

DTS_E_DTSPROCTASK_CONNECTIONMANAGERNOTOLAP DTS_E_DTSPROCTASK_CONNECTIONMANAGERNOTOLAP DTS_E_DTSPROCTASK_CONNECTIONMANAGERNOTOLAP

The connection "%1" is not an Analysis Services connection.

DTS_E_DTSPROCTASK_CONNECTIONNOTFOUND DTS_E_DTSPROCTASK_CONNECTIONNOTFOUND DTS_E_DTSPROCTASK_CONNECTIONNOTFOUND

The Connection Manager "%1" it's not defined.

DTS_E_DTSPROCTASK_DDLEXECUTIONFAILED DTS_E_DTSPROCTASK_DDLEXECUTIONFAILED DTS_E_DTSPROCTASK_DDLEXECUTIONFAILED

The execution of DDL failed.

DTS_E_DTSPROCTASK_FILECONNECTIONNOTDEFINED DTS_E_DTSPROCTASK_FILECONNECTIONNOTDEFINED DTS_E_DTSPROCTASK_FILECONNECTIONNOTDEFINED

The file connection "%1" is not defined.

DTS_E_DTSPROCTASK_FILEDOESNOTEXIST DTS_E_DTSPROCTASK_FILEDOESNOTEXIST DTS_E_DTSPROCTASK_FILEDOESNOTEXIST

There is no file associated with connection "%1".

DTS_E_DTSPROCTASK_INVALIDCONNECTION DTS_E_DTSPROCTASK_INVALIDCONNECTION DTS_E_DTSPROCTASK_INVALIDCONNECTION

The Connection Manager "%1" it's not a FILE Connection Manager.

DTS_E_DTSPROCTASK_INVALIDDDL DTS_E_DTSPROCTASK_INVALIDDDL DTS_E_DTSPROCTASK_INVALIDDDL

The DDL is not valid.

DTS_E_DTSPROCTASK_INVALIDDDLPROCESSINGCOMMANDS DTS_E_DTSPROCTASK_INVALIDDDLPROCESSINGCOMMANDS DTS_E_DTSPROCTASK_INVALIDDDLPROCESSINGCOMMANDS

The DDL found in ProcessingCommands is not valid.

DTS_E_DTSPROCTASK_INVALIDTASKDATANODEEXE DTS_E_DTSPROCTASK_INVALIDTASKDATANODEEXE DTS_E_DTSPROCTASK_INVALIDTASKDATANODEEXE

The Analysis Services Execute DDL task received an invalid task data node.

DTS_E_DTSPROCTASK_INVALIDTASKDATANODEPROC DTS_E_DTSPROCTASK_INVALIDTASKDATANODEPROC DTS_E_DTSPROCTASK_INVALIDTASKDATANODEPROC

The Analysis Services Processing task received an invalid task data node.

DTS_E_DTSPROCTASK_INVALIDVARIABLE DTS_E_DTSPROCTASK_INVALIDVARIABLE DTS_E_DTSPROCTASK_INVALIDVARIABLE

The variable "%1" it's not defined.

DTS_E_DTSPROCTASK_NOCONNECTIONSPECIFIED DTS_E_DTSPROCTASK_NOCONNECTIONSPECIFIED DTS_E_DTSPROCTASK_NOCONNECTIONSPECIFIED

The connection manager is not specified.

DTS_E_DTSPROCTASK_NONEXISTENTATTRIBUTE DTS_E_DTSPROCTASK_NONEXISTENTATTRIBUTE DTS_E_DTSPROCTASK_NONEXISTENTATTRIBUTE

The "%1" was not found during deserialization.

DTS_E_DTSPROCTASK_TRACEHASBEENSTOPPED DTS_E_DTSPROCTASK_TRACEHASBEENSTOPPED DTS_E_DTSPROCTASK_TRACEHASBEENSTOPPED

The trace has been stopped due to an exception.

DTS_E_DTSPROCTASK_UNABLETOLOCATECONNECTIONMANAGER DTS_E_DTSPROCTASK_UNABLETOLOCATECONNECTIONMANAGER DTS_E_DTSPROCTASK_UNABLETOLOCATECONNECTIONMANAGER

The connection "%1" cannot be located.

DTS_E_DTSPROCTASK_VARIABLENOTDEFINED DTS_E_DTSPROCTASK_VARIABLENOTDEFINED DTS_E_DTSPROCTASK_VARIABLENOTDEFINED

The variable "%1" is not defined.

DTS_E_DUMP_FAILED DTS_E_DUMP_FAILED DTS_E_DUMP_FAILED

The debug dump files were not generated correctly. The HResult is __.

DTS_E_DUPLICATECOLUMNNAME DTS_E_DUPLICATECOLUMNNAME DTS_E_DUPLICATECOLUMNNAME

The column name "%1" already exists.

DTS_E_DUPLICATECONSTRAINT DTS_E_DUPLICATECONSTRAINT DTS_E_DUPLICATECONSTRAINT

A precedence constraint already exists between the specified executable. More than one precedence constraint is not allowed.

DTS_E_DUPLICATEDATASOURCECOLUMNNAME DTS_E_DUPLICATEDATASOURCECOLUMNNAME DTS_E_DUPLICATEDATASOURCECOLUMNNAME

There is more than one data source column with the name "%1". The data source column names must be unique.

DTS_E_DUPLICATEIDFOUND DTS_E_DUPLICATEIDFOUND DTS_E_DUPLICATEIDFOUND

Attempting to use ID %1!d! more than once in the Data Flow Task.

DTS_E_DUPLICATELINEAGEIDSINCOLLECTION DTS_E_DUPLICATELINEAGEIDSINCOLLECTION DTS_E_DUPLICATELINEAGEIDSINCOLLECTION

Two objects in the same collection have a duplicate lineage ID of %1!d!. The objects are %2 and %3.

DTS_E_DUPLICATENAMESINCOLLECTION DTS_E_DUPLICATENAMESINCOLLECTION DTS_E_DUPLICATENAMESINCOLLECTION

The package contains two objects with the duplicate name of "%1" and "%2".

DTS_E_DUPLICATEOUTPUTCOLUMNNAMES DTS_E_DUPLICATEOUTPUTCOLUMNNAMES DTS_E_DUPLICATEOUTPUTCOLUMNNAMES

The name for "%1" is a duplicate. All names must be unique.

DTS_E_ELEMENTNOTFOUND DTS_E_ELEMENTNOTFOUND DTS_E_ELEMENTNOTFOUND

The element cannot be found in a collection. This error happens when you try to retrieve an element from a collection on a container during execution of the package and the element is not there.

DTS_E_EMPTYRUNTIMECONNECTIONMANAGERID DTS_E_EMPTYRUNTIMECONNECTIONMANAGERID DTS_E_EMPTYRUNTIMECONNECTIONMANAGERID

The "%1" in the connection manager collection, Connections, of "%2" does not have a value for the ID property. Verify that the ConnectionManagerID property of the runtime connection object has been set for the component.

DTS_E_ENUMERATIONELEMENTNOTENUMERABLE DTS_E_ENUMERATIONELEMENTNOTENUMERABLE DTS_E_ENUMERATIONELEMENTNOTENUMERABLE

An element of the enumerator returned by the ForEach Enumerator does not implement IEnumerator, contradicting the CollectionEnumerator property of the ForEach Enumerator.

DTS_E_EOFANNOUNCEMENTFAILED DTS_E_EOFANNOUNCEMENTFAILED DTS_E_EOFANNOUNCEMENTFAILED

The Data Flow task cannot create a buffer to mark the end of the rowset.

DTS_E_ERRMSGTASK_DIFFERENTMESSAGEANDLANGUAGESIZES DTS_E_ERRMSGTASK_DIFFERENTMESSAGEANDLANGUAGESIZES DTS_E_ERRMSGTASK_DIFFERENTMESSAGEANDLANGUAGESIZES

The lists of error messages and their corresponding languages are of different sizes.

DTS_E_ERRMSGTASK_EMPTYSOURCELIST DTS_E_ERRMSGTASK_EMPTYSOURCELIST DTS_E_ERRMSGTASK_EMPTYSOURCELIST

There are no Error Messages to transfer.

DTS_E_ERRMSGTASK_ERRORMESSAGEALREADYEXISTS DTS_E_ERRMSGTASK_ERRORMESSAGEALREADYEXISTS DTS_E_ERRMSGTASK_ERRORMESSAGEALREADYEXISTS

The error message "%1" already exists at destination server.

DTS_E_ERRMSGTASK_ERRORMESSAGECANTBEFOUND DTS_E_ERRMSGTASK_ERRORMESSAGECANTBEFOUND DTS_E_ERRMSGTASK_ERRORMESSAGECANTBEFOUND

The error message "%1" cannot be found at source server.

DTS_E_ERRMSGTASK_ERRORMESSAGEOUTOFRANGE DTS_E_ERRMSGTASK_ERRORMESSAGEOUTOFRANGE DTS_E_ERRMSGTASK_ERRORMESSAGEOUTOFRANGE

The error message id "%1" is out of the allowed range of user defined error messages. User defined error message ids are between 50000 and 2147483647.

DTS_E_ERRMSGTASK_FAILEDTOTRANSFERERRORMESSAGES DTS_E_ERRMSGTASK_FAILEDTOTRANSFERERRORMESSAGES DTS_E_ERRMSGTASK_FAILEDTOTRANSFERERRORMESSAGES

Some or all of the Error Messages failed to transfer.

DTS_E_ERRORATLOADTASK DTS_E_ERRORATLOADTASK DTS_E_ERRORATLOADTASK

There is an error loading task. This happens when loading a task from XML fails.

DTS_E_ERRORCOLUMNHASINCORRECTPROPERTIES DTS_E_ERRORCOLUMNHASINCORRECTPROPERTIES DTS_E_ERRORCOLUMNHASINCORRECTPROPERTIES

The %1 on the error output has properties that do not match the properties of its corresponding data source column.

DTS_E_ERRORCOLUMNHASNOOUTPUTCOLUMN DTS_E_ERRORCOLUMNHASNOOUTPUTCOLUMN DTS_E_ERRORCOLUMNHASNOOUTPUTCOLUMN

The %1 on the error output has no corresponding output column on the non-error output.

DTS_E_ERRORCOMPONENT DTS_E_ERRORCOMPONENT DTS_E_ERRORCOMPONENT

The component is missing, not registered, not upgradeable, or missing required interfaces. The contact information for this component is "%1".

DTS_E_ERRORELEMENTNOTINCOLL DTS_E_ERRORELEMENTNOTINCOLL DTS_E_ERRORELEMENTNOTINCOLL

The element "%1" does not exist in collection "%2".

DTS_E_ERRORLOADINGTASK DTS_E_ERRORLOADINGTASK DTS_E_ERRORLOADINGTASK

There is an error loading a task. The contact information for the task is "%1". This happens when loading a task fails.

DTS_E_ERRORLOADINGTASKNOCONTACT DTS_E_ERRORLOADINGTASKNOCONTACT DTS_E_ERRORLOADINGTASKNOCONTACT

There is an error loading task "%1".

DTS_E_ERROROCCURREDWHILERETRIEVINGFILENAME DTS_E_ERROROCCURREDWHILERETRIEVINGFILENAME DTS_E_ERROROCCURREDWHILERETRIEVINGFILENAME

Retrieving the file name for a component failed with error code 0x%1!8.8X!.

DTS_E_ERROROCCURREDWITHFOLLOWINGMESSAGE DTS_E_ERROROCCURREDWITHFOLLOWINGMESSAGE DTS_E_ERROROCCURREDWITHFOLLOWINGMESSAGE

An error occurred with the following error message: "%1".

DTS_E_ERROROUTCANTBEONSYNCNONEXCLUSIVEOUTPUT DTS_E_ERROROUTCANTBEONSYNCNONEXCLUSIVEOUTPUT DTS_E_ERROROUTCANTBEONSYNCNONEXCLUSIVEOUTPUT

The "%1" cannot be an error output because error outputs cannot be placed on synchronous, non-exclusive outputs.

DTS_E_ERRORPERSISTMANAGEDTASK DTS_E_ERRORPERSISTMANAGEDTASK DTS_E_ERRORPERSISTMANAGEDTASK

The error persist managed task.

DTS_E_ERRORRETRIEVINGCOLUMNCODEPAGE DTS_E_ERRORRETRIEVINGCOLUMNCODEPAGE DTS_E_ERRORRETRIEVINGCOLUMNCODEPAGE

There was an error retrieving column code page information.

DTS_E_ERRORROWDISPMUSTBENOTUSED DTS_E_ERRORROWDISPMUSTBENOTUSED DTS_E_ERRORROWDISPMUSTBENOTUSED

The %1 must have its error row disposition value set to RD_NotUsed.

DTS_E_ERRORWHILEREADINGDATAROWS DTS_E_ERRORWHILEREADINGDATAROWS DTS_E_ERRORWHILEREADINGDATAROWS

An error occurred while processing file "%1" on data row %2!I64d!.

DTS_E_ERRORWHILEREADINGHEADERROWS DTS_E_ERRORWHILEREADINGHEADERROWS DTS_E_ERRORWHILEREADINGHEADERROWS

An error occurred while reading header rows.

DTS_E_ERRORWHILESKIPPINGDATAROWS DTS_E_ERRORWHILESKIPPINGDATAROWS DTS_E_ERRORWHILESKIPPINGDATAROWS

An error occurred while skipping data rows.

DTS_E_EVENTHANDLERNAMEREADONLY DTS_E_EVENTHANDLERNAMEREADONLY DTS_E_EVENTHANDLERNAMEREADONLY

Changing the event handler name failed. Event handler names are read-only.

DTS_E_EVENTHANDLERNOTALLOWED DTS_E_EVENTHANDLERNOTALLOWED DTS_E_EVENTHANDLERNOTALLOWED

The task providing the custom event "%1" does not allow this event to be handled in the package. The custom event was declared with AllowEventHandlers = FALSE.

DTS_E_EXCLGRPNOSYNCINP DTS_E_EXCLGRPNOSYNCINP DTS_E_EXCLGRPNOSYNCINP

The "%1" has a virtual buffer extending from a root source. There is an exclusion group that is not zero with a synchronous input that is zero.

DTS_E_EXEC2000PKGTASK_CLS_NOT_REGISTRED_EXCEPTION DTS_E_EXEC2000PKGTASK_CLS_NOT_REGISTRED_EXCEPTION DTS_E_EXEC2000PKGTASK_CLS_NOT_REGISTRED_EXCEPTION

To execute the DTS 2000 Package task, start SQL Server Setup and use the Advanced button from the Components to Install page to select Legacy Components.

DTS_E_EXEC2000PKGTASK_CONVERT_FAILED DTS_E_EXEC2000PKGTASK_CONVERT_FAILED DTS_E_EXEC2000PKGTASK_CONVERT_FAILED

The "%1" cannot be converted to "%2".

DTS_E_EXEC2000PKGTASK_DATATYPE_NULL DTS_E_EXEC2000PKGTASK_DATATYPE_NULL DTS_E_EXEC2000PKGTASK_DATATYPE_NULL

The data type cannot be null. Please specify the correct data type to use for validating the value.

DTS_E_EXEC2000PKGTASK_DTS2000CANTBEEMPTY DTS_E_EXEC2000PKGTASK_DTS2000CANTBEEMPTY DTS_E_EXEC2000PKGTASK_DTS2000CANTBEEMPTY

The DTS 2000 package property is empty.

DTS_E_EXEC2000PKGTASK_ERROR_IN_LOAD_FROM_XML DTS_E_EXEC2000PKGTASK_ERROR_IN_LOAD_FROM_XML DTS_E_EXEC2000PKGTASK_ERROR_IN_LOAD_FROM_XML

An error occurred in LoadFromXML at the tag "%1".

DTS_E_EXEC2000PKGTASK_ERROR_IN_PACKAGE_EXECUTE DTS_E_EXEC2000PKGTASK_ERROR_IN_PACKAGE_EXECUTE DTS_E_EXEC2000PKGTASK_ERROR_IN_PACKAGE_EXECUTE

An error occurred while executing the DTS 2000 package.

DTS_E_EXEC2000PKGTASK_ERROR_IN_SAVE_TO_XML DTS_E_EXEC2000PKGTASK_ERROR_IN_SAVE_TO_XML DTS_E_EXEC2000PKGTASK_ERROR_IN_SAVE_TO_XML

An error occurred in SaveToXML at the tag "%1".

DTS_E_EXEC2000PKGTASK_ERROR_IN_VALIDATE DTS_E_EXEC2000PKGTASK_ERROR_IN_VALIDATE DTS_E_EXEC2000PKGTASK_ERROR_IN_VALIDATE

The "%1" cannot be validated against "%2".

DTS_E_EXEC2000PKGTASK_FILE_NAME_NOT_SPECIFIED DTS_E_EXEC2000PKGTASK_FILE_NAME_NOT_SPECIFIED DTS_E_EXEC2000PKGTASK_FILE_NAME_NOT_SPECIFIED

The storage file name is not specified.

DTS_E_EXEC2000PKGTASK_HANDLER_NOT_FOUND DTS_E_EXEC2000PKGTASK_HANDLER_NOT_FOUND DTS_E_EXEC2000PKGTASK_HANDLER_NOT_FOUND

The handler is not found.

DTS_E_EXEC2000PKGTASK_INITIALIZATION_WITH_WRONG_XML_ELEMENT DTS_E_EXEC2000PKGTASK_INITIALIZATION_WITH_WRONG_XML_ELEMENT DTS_E_EXEC2000PKGTASK_INITIALIZATION_WITH_WRONG_XML_ELEMENT

The Execute DTS 2000 Package task is initiated with a wrong XML element.

DTS_E_EXEC2000PKGTASK_NOT_PRIMITIVE_TYPE DTS_E_EXEC2000PKGTASK_NOT_PRIMITIVE_TYPE DTS_E_EXEC2000PKGTASK_NOT_PRIMITIVE_TYPE

The "%1" is not a value type.

DTS_E_EXEC2000PKGTASK_NULL_VALUE DTS_E_EXEC2000PKGTASK_NULL_VALUE DTS_E_EXEC2000PKGTASK_NULL_VALUE

A null cannot be validated against any data type.

DTS_E_EXEC2000PKGTASK_NULL_VALUE_ARGUMENT DTS_E_EXEC2000PKGTASK_NULL_VALUE_ARGUMENT DTS_E_EXEC2000PKGTASK_NULL_VALUE_ARGUMENT

A required argument is null.

DTS_E_EXEC2000PKGTASK_PACKAGE_ID_NOT_SPECIFIED DTS_E_EXEC2000PKGTASK_PACKAGE_ID_NOT_SPECIFIED DTS_E_EXEC2000PKGTASK_PACKAGE_ID_NOT_SPECIFIED

The package ID is not specified.

DTS_E_EXEC2000PKGTASK_PACKAGE_NAME_NOT_SPECIFIED DTS_E_EXEC2000PKGTASK_PACKAGE_NAME_NOT_SPECIFIED DTS_E_EXEC2000PKGTASK_PACKAGE_NAME_NOT_SPECIFIED

The package name is not specified.

DTS_E_EXEC2000PKGTASK_PACKAGE_VERSIONGUID_NOT_SPECIFIED DTS_E_EXEC2000PKGTASK_PACKAGE_VERSIONGUID_NOT_SPECIFIED DTS_E_EXEC2000PKGTASK_PACKAGE_VERSIONGUID_NOT_SPECIFIED

The package version GUID is not specified.

DTS_E_EXEC2000PKGTASK_SQL_USERNAME_NOT_SPECIFIED DTS_E_EXEC2000PKGTASK_SQL_USERNAME_NOT_SPECIFIED DTS_E_EXEC2000PKGTASK_SQL_USERNAME_NOT_SPECIFIED

The SQL Server user name not specified.

DTS_E_EXEC2000PKGTASK_SQLSERVER_NOT_AVAILABLE_NETWORK DTS_E_EXEC2000PKGTASK_SQLSERVER_NOT_AVAILABLE_NETWORK DTS_E_EXEC2000PKGTASK_SQLSERVER_NOT_AVAILABLE_NETWORK

The available SQL Servers cannot be loaded from the network. Check the network connection.

DTS_E_EXEC2000PKGTASK_SQLSERVER_NOT_SPECIFIED DTS_E_EXEC2000PKGTASK_SQLSERVER_NOT_SPECIFIED DTS_E_EXEC2000PKGTASK_SQLSERVER_NOT_SPECIFIED

The SQL Server is not specified.

DTS_E_EXECPROCTASK_CANTREDIRECTIO DTS_E_EXECPROCTASK_CANTREDIRECTIO DTS_E_EXECPROCTASK_CANTREDIRECTIO

The streams cannot be redirected if the process can continue executing beyond the lifetime of the task.

DTS_E_EXECPROCTASK_ERROREXECUTIONVALUE DTS_E_EXECPROCTASK_ERROREXECUTIONVALUE DTS_E_EXECPROCTASK_ERROREXECUTIONVALUE

The process exited with return code "%1". However, "%2" was expected.

DTS_E_EXECPROCTASK_EXECUTABLENOTSPECIFIED DTS_E_EXECPROCTASK_EXECUTABLENOTSPECIFIED DTS_E_EXECPROCTASK_EXECUTABLENOTSPECIFIED

The executable is not specified.

DTS_E_EXECPROCTASK_FILEDOESNOTEXIST DTS_E_EXECPROCTASK_FILEDOESNOTEXIST DTS_E_EXECPROCTASK_FILEDOESNOTEXIST

The File/Process "%1" does not exist in directory "%2".

DTS_E_EXECPROCTASK_FILENOTINPATH DTS_E_EXECPROCTASK_FILENOTINPATH DTS_E_EXECPROCTASK_FILENOTINPATH

The File/Process "%1" is not in path.

DTS_E_EXECPROCTASK_INVALIDTIMEOUT DTS_E_EXECPROCTASK_INVALIDTIMEOUT DTS_E_EXECPROCTASK_INVALIDTIMEOUT

The time-out value provided is not valid. Specify the number of seconds that the task allows the process to run. The minimum time-out is 0, which indicates that no time-out value is used and the process runs to completion or until an error occurs. The maximum time-out is 2147483 (((2^31) - 1)/1000).

DTS_E_EXECPROCTASK_PROCESSEXITCODEEXCEEDS DTS_E_EXECPROCTASK_PROCESSEXITCODEEXCEEDS DTS_E_EXECPROCTASK_PROCESSEXITCODEEXCEEDS

In Executing "%2" "%3" at "%1", the process exit code was "%4" while the expected was "%5".

DTS_E_EXECPROCTASK_PROCESSHASTIMEDOUT DTS_E_EXECPROCTASK_PROCESSHASTIMEDOUT DTS_E_EXECPROCTASK_PROCESSHASTIMEDOUT

The process has timed out.

DTS_E_EXECPROCTASK_RECEIVEDINVALIDTASKDATANODE DTS_E_EXECPROCTASK_RECEIVEDINVALIDTASKDATANODE DTS_E_EXECPROCTASK_RECEIVEDINVALIDTASKDATANODE

The Execute Process task received a task data node that is not valid.

DTS_E_EXECPROCTASK_STDERRVARREADONLY DTS_E_EXECPROCTASK_STDERRVARREADONLY DTS_E_EXECPROCTASK_STDERRVARREADONLY

The standard error variable is read-only.

DTS_E_EXECPROCTASK_STDOUTVARREADONLY DTS_E_EXECPROCTASK_STDOUTVARREADONLY DTS_E_EXECPROCTASK_STDOUTVARREADONLY

The standard out variable is read-only.

DTS_E_EXECPROCTASK_WORKINGDIRDOESNOTEXIST DTS_E_EXECPROCTASK_WORKINGDIRDOESNOTEXIST DTS_E_EXECPROCTASK_WORKINGDIRDOESNOTEXIST

The directory "%1" does not exist.

DTS_E_EXECPROCTASK_WORKINGDIRECTORYDOESNOTEXIST DTS_E_EXECPROCTASK_WORKINGDIRECTORYDOESNOTEXIST DTS_E_EXECPROCTASK_WORKINGDIRECTORYDOESNOTEXIST

The Working Directory "%1" does not exist.

DTS_E_EXECUTIONTREECYCLE DTS_E_EXECUTIONTREECYCLE DTS_E_EXECUTIONTREECYCLE

The %1 cannot connect to %2 because a cycle would be created.

DTS_E_EXECUTIONTREECYCLEADDINGSYNCHRONOUSINPUT DTS_E_EXECUTIONTREECYCLEADDINGSYNCHRONOUSINPUT DTS_E_EXECUTIONTREECYCLEADDINGSYNCHRONOUSINPUT

The synchronous input of "%1" cannot be set to "%2" because a cycle would be created.

DTS_E_EXECUTIONTREECYCLESETTINGID DTS_E_EXECUTIONTREECYCLESETTINGID DTS_E_EXECUTIONTREECYCLESETTINGID

The ID %1 cannot be set to %2!d! because a cycle would be created.

DTS_E_EXISTSONSQLSERVER_OLEDB DTS_E_EXISTSONSQLSERVER_OLEDB DTS_E_EXISTSONSQLSERVER_OLEDB

The ExistsOnSQLServer method has encountered OLE DB error code 0x%1!8.8X! (%2). The SQL statement issued has failed.

DTS_E_EXPIRED DTS_E_EXPIRED DTS_E_EXPIRED

The Integration Services evaluation period has expired.

DTS_E_EXPRESSIONCOMPUTEFAILED DTS_E_EXPRESSIONCOMPUTEFAILED DTS_E_EXPRESSIONCOMPUTEFAILED

Computing the expression "%1" failed with error code 0x%2!8.8X!. The expression may have errors, such as divide by zero, that cannot be detected at parse time, or there may be an out-of-memory error.

DTS_E_EXPRESSIONNOTBOOLEAN DTS_E_EXPRESSIONNOTBOOLEAN DTS_E_EXPRESSIONNOTBOOLEAN

The expression "%1" must evaluate to True or False. Change the expression to evaluate to a Boolean value.

DTS_E_EXPRESSIONPARSEFAILED DTS_E_EXPRESSIONPARSEFAILED DTS_E_EXPRESSIONPARSEFAILED

The expression "%1" cannot be parsed. The expression was not valid, or there is an out-of-memory error.

DTS_E_EXPRESSIONVALIDATIONFAILED DTS_E_EXPRESSIONVALIDATIONFAILED DTS_E_EXPRESSIONVALIDATIONFAILED

The expression "%1" on "%2" is not valid.

DTS_E_EXPREVALAMBIGUOUSINPUTCOLUMNNAME DTS_E_EXPREVALAMBIGUOUSINPUTCOLUMNNAME DTS_E_EXPREVALAMBIGUOUSINPUTCOLUMNNAME

There are multiple input columns with the name "%1". The desired input column must be specified uniquely as [Component Name].[%2] or referenced by lineage ID. Currently, the input column specified exists on more than one component.

DTS_E_EXPREVALAMBIGUOUSVARIABLENNAME DTS_E_EXPREVALAMBIGUOUSVARIABLENNAME DTS_E_EXPREVALAMBIGUOUSVARIABLENNAME

There are multiple variables with the name "%1". The desired variable must be specified uniquely as @[Namespace::%2]. The variable exists in more than one namespace.

DTS_E_EXPREVALASSIGNMENTTOREADONLYVARIABLE DTS_E_EXPREVALASSIGNMENTTOREADONLYVARIABLE DTS_E_EXPREVALASSIGNMENTTOREADONLYVARIABLE

There is an error using a read-only variable "%1" in an assignment expression. The expression result cannot be assigned to the variable because the variable is read only. Choose a variable that can be written to, or remove the expression from this variable.

DTS_E_EXPREVALASSIGNMENTTYPEMISMATCH DTS_E_EXPREVALASSIGNMENTTYPEMISMATCH DTS_E_EXPREVALASSIGNMENTTYPEMISMATCH

The result of the assignment expression "%1" cannot be converted to a type that is compatible with the variable that it was assigned to.

DTS_E_EXPREVALASSIGNMENTVARIABLELOCKFORWRITEFAILED DTS_E_EXPREVALASSIGNMENTVARIABLELOCKFORWRITEFAILED DTS_E_EXPREVALASSIGNMENTVARIABLELOCKFORWRITEFAILED

The expression "%1" cannot be evaluated because the variable "%2" does not exist or cannot be accessed for writing. The expression result cannot be assigned to the variable because the variable was not found, or could not be locked for write access.

DTS_E_EXPREVALBINARYOPDTSTRNOTSUPPORTED DTS_E_EXPREVALBINARYOPDTSTRNOTSUPPORTED DTS_E_EXPREVALBINARYOPDTSTRNOTSUPPORTED

For operands of a binary operation, the data type DT_STR is supported only for input columns and cast operations. The expression "%1" has a DT_STR operand that is not an input column or the result of a cast, and cannot be used in a binary operation. To perform this operation, the operand needs to be explicitly cast with a cast operator.

DTS_E_EXPREVALBINARYOPERATIONFAILED DTS_E_EXPREVALBINARYOPERATIONFAILED DTS_E_EXPREVALBINARYOPERATIONFAILED

The binary operation "%1" failed with error code 0x%2!8.8X!. An internal error occurred, or an out-of-memory condition exists.

DTS_E_EXPREVALBINARYOPERATIONSETTYPEFAILED DTS_E_EXPREVALBINARYOPERATIONSETTYPEFAILED DTS_E_EXPREVALBINARYOPERATIONSETTYPEFAILED

Attempt to set the result type of binary operation "%1" failed with error code 0x%2!8.8X!.

DTS_E_EXPREVALBINARYOPERATORCODEPAGEMISMATCH DTS_E_EXPREVALBINARYOPERATORCODEPAGEMISMATCH DTS_E_EXPREVALBINARYOPERATORCODEPAGEMISMATCH

The code pages for operands of binary operator "%1" for type "%2" must match. Currently, the code page of the left operand does not match the code page of the right operand. For the specified binary operator on the specified type, the code pages must be the same.

DTS_E_EXPREVALBINARYOPNUMERICOVERFLOW DTS_E_EXPREVALBINARYOPNUMERICOVERFLOW DTS_E_EXPREVALBINARYOPNUMERICOVERFLOW

The result of the binary operation "%1" on data types %2 and %3 exceeds the maximum size for numeric types. The operand types could not be implicitly cast into a numeric (DT_NUMERIC) result without loss of precision or scale. To perform this operation, one or both operands need to be explicitly cast with a cast operator.

DTS_E_EXPREVALBINARYOPOVERFLOW DTS_E_EXPREVALBINARYOPOVERFLOW DTS_E_EXPREVALBINARYOPOVERFLOW

The result of the binary operation "%1" exceeds the maximum size for result data type "%2". The magnitude of the result of the operation overflows the type of the result.

DTS_E_EXPREVALBINARYSIGNMISMATCH DTS_E_EXPREVALBINARYSIGNMISMATCH DTS_E_EXPREVALBINARYSIGNMISMATCH

There is a sign mismatch for the bitwise binary operator "%1" in operation "%2". Both operands for this operator must be positive or negative.

DTS_E_EXPREVALBINARYTYPEMISMATCH DTS_E_EXPREVALBINARYTYPEMISMATCH DTS_E_EXPREVALBINARYTYPEMISMATCH

The data types "%1" and "%2" are incompatible for binary operator "%3". The operand types could not be implicitly cast into compatible types for the operation. To perform this operation, one or both operands need to be explicitly cast with a cast operator.

DTS_E_EXPREVALBUILDSTRINGFAILED DTS_E_EXPREVALBUILDSTRINGFAILED DTS_E_EXPREVALBUILDSTRINGFAILED

Attempt to generate a string representation of the expression failed with error code 0x%1!8.8X!. Failed when attempting to generate a displayable string that represents the expression.

DTS_E_EXPREVALCANNOTCONVERTRESULT DTS_E_EXPREVALCANNOTCONVERTRESULT DTS_E_EXPREVALCANNOTCONVERTRESULT

The expression result data type "%1" cannot be converted to the column data type "%2". The result of the expression should be written to an input/output column, but the data type of the expression cannot be converted to the data type of the column.

DTS_E_EXPREVALCASTCODEPAGEMISMATCH DTS_E_EXPREVALCASTCODEPAGEMISMATCH DTS_E_EXPREVALCASTCODEPAGEMISMATCH

Unable to cast expression "%1" from data type "%2" to data type "%3" because the code page of the value being cast (%4!d!) does not match the requested result code page (%5!d!). The code page of the source must match the code page requested for the destination.

DTS_E_EXPREVALCASTFAILED DTS_E_EXPREVALCASTFAILED DTS_E_EXPREVALCASTFAILED

Casting expression "%1" from data type "%2" to data type "%3" failed with error code 0x%4!8.8X!.

DTS_E_EXPREVALCHARMAPPINGFAILED DTS_E_EXPREVALCHARMAPPINGFAILED DTS_E_EXPREVALCHARMAPPINGFAILED

The function "%1" cannot perform the character mapping on string "%2".

DTS_E_EXPREVALCOMPUTEFAILED DTS_E_EXPREVALCOMPUTEFAILED DTS_E_EXPREVALCOMPUTEFAILED

Attempt to compute the expression "%1" failed with error code 0x%2!8.8X!.

DTS_E_EXPREVALCONDITIONALOPCODEPAGEMISMATCH DTS_E_EXPREVALCONDITIONALOPCODEPAGEMISMATCH DTS_E_EXPREVALCONDITIONALOPCODEPAGEMISMATCH

The code pages must match for operands of conditional operation "%1" for type %2. The code page of the left operand does not match the code page of the right operand. For the conditional operator on the specified type, the code pages must be the same.

DTS_E_EXPREVALCONDITIONALOPDTSTRNOTSUPPORTED DTS_E_EXPREVALCONDITIONALOPDTSTRNOTSUPPORTED DTS_E_EXPREVALCONDITIONALOPDTSTRNOTSUPPORTED

For operands of the conditional operator, the data type DT_STR is supported only for input columns and cast operations. The expression "%1" has a DT_STR operand that is not an input column or the result of a cast, and cannot be used with the conditional operation. To perform this operation, the operand needs to be explicitly cast with a cast operator.

DTS_E_EXPREVALCONDITIONALOPERATIONFAILED DTS_E_EXPREVALCONDITIONALOPERATIONFAILED DTS_E_EXPREVALCONDITIONALOPERATIONFAILED

The conditional operation "%1" failed with error code 0x%2!8.8X!. There was an internal error or an out-of-memory error.

DTS_E_EXPREVALCONDITIONALOPINVALIDCONDITIONTYPE DTS_E_EXPREVALCONDITIONALOPINVALIDCONDITIONTYPE DTS_E_EXPREVALCONDITIONALOPINVALIDCONDITIONTYPE

The conditional expression "%1" of the conditional operator has an invalid data type of "%2". The conditional expression of the conditional operator must return a Boolean, which is type DT_BOOL.

DTS_E_EXPREVALCONDITIONALOPSETTYPEFAILED DTS_E_EXPREVALCONDITIONALOPSETTYPEFAILED DTS_E_EXPREVALCONDITIONALOPSETTYPEFAILED

Attempt to set the result type of conditional operation "%1" failed with error code 0x%2!8.8X!.

DTS_E_EXPREVALCONDITIONALOPTYPEMISMATCH DTS_E_EXPREVALCONDITIONALOPTYPEMISMATCH DTS_E_EXPREVALCONDITIONALOPTYPEMISMATCH

The data types "%1" and "%2" are incompatible for the conditional operator. The operand types cannot be implicitly cast into compatible types for the conditional operation. To perform this operation, one or both operands need to be explicitly cast with a cast operator.

DTS_E_EXPREVALDATACONVERSIONFAILED DTS_E_EXPREVALDATACONVERSIONFAILED DTS_E_EXPREVALDATACONVERSIONFAILED

The error code 0x%1!8.8X! occurred attempting to convert from data type %2 to data type %3.

DTS_E_EXPREVALDATACONVERSIONNOTSUPPORTED DTS_E_EXPREVALDATACONVERSIONNOTSUPPORTED DTS_E_EXPREVALDATACONVERSIONNOTSUPPORTED

The conversion from data type "%1" to data type "%2" is unsupported. The source type cannot be converted to the destination type.

DTS_E_EXPREVALDATACONVERSIONOVERFLOW DTS_E_EXPREVALDATACONVERSIONOVERFLOW DTS_E_EXPREVALDATACONVERSIONOVERFLOW

An overflow occurred while converting from data type "%1" to data type "%2". The source type is too large for the destination type.

DTS_E_EXPREVALDIVBYZERO DTS_E_EXPREVALDIVBYZERO DTS_E_EXPREVALDIVBYZERO

A divide-by-zero error occurred. The right side operand evaluates to zero in the expression "%1".

DTS_E_EXPREVALDOTTEDINPUTCOLUMNNAMENOTFOUND DTS_E_EXPREVALDOTTEDINPUTCOLUMNNAMENOTFOUND DTS_E_EXPREVALDOTTEDINPUTCOLUMNNAMENOTFOUND

Locating the input column named "[%1].[%2]" failed with error code 0x%3!8.8X!. The input column was not found in the input column collection.

DTS_E_EXPREVALEXPRESSIONEMPTY DTS_E_EXPREVALEXPRESSIONEMPTY DTS_E_EXPREVALEXPRESSIONEMPTY

There was no expression to compute. An attempt was made to compute or get the string of an empty expression.

DTS_E_EXPREVALFAILEDTOCONVERTSTRCOLUMNTOWSTR DTS_E_EXPREVALFAILEDTOCONVERTSTRCOLUMNTOWSTR DTS_E_EXPREVALFAILEDTOCONVERTSTRCOLUMNTOWSTR

Converting "%1" from type DT_STR to type DT_WSTR failed with error code 0x%2!8.8X!. An error occurred while performing the implicit conversion on the input column.

DTS_E_EXPREVALFAILEDTOPARSEEXPRESSION DTS_E_EXPREVALFAILEDTOPARSEEXPRESSION DTS_E_EXPREVALFAILEDTOPARSEEXPRESSION

The expression "%1" is not valid and cannot be parsed. The expression may contain invalid elements or it may not be well-formed.

DTS_E_EXPREVALFAILEDTOPARSEEXPRESSIONOUTOFMEMORY DTS_E_EXPREVALFAILEDTOPARSEEXPRESSIONOUTOFMEMORY DTS_E_EXPREVALFAILEDTOPARSEEXPRESSIONOUTOFMEMORY

Attempt to parse the expression "%1" failed because there was an out-of-memory error.

DTS_E_EXPREVALFAILEDTOPARSEEXPRESSIONWITHHR DTS_E_EXPREVALFAILEDTOPARSEEXPRESSIONWITHHR DTS_E_EXPREVALFAILEDTOPARSEEXPRESSIONWITHHR

Attempt to parse the expression "%1" failed and returned error code 0x%2!8.8X!. The expression cannot be parsed. It might contain invalid elements or it might not be well-formed. There may also be an out-of-memory error.

DTS_E_EXPREVALFNFINDSTRINGINVALIDOCCURRENCECOUNT DTS_E_EXPREVALFNFINDSTRINGINVALIDOCCURRENCECOUNT DTS_E_EXPREVALFNFINDSTRINGINVALIDOCCURRENCECOUNT

The occurrence count %1!d! is not valid for function "%2". This parameter must be greater than zero.

DTS_E_EXPREVALFNLEFTRIGHTINVALIDLENGTH DTS_E_EXPREVALFNLEFTRIGHTINVALIDLENGTH DTS_E_EXPREVALFNLEFTRIGHTINVALIDLENGTH

The length of the expression from left to right is invalid.

DTS_E_EXPREVALFNREPLICATEINVALIDREPEATCOUNT DTS_E_EXPREVALFNREPLICATEINVALIDREPEATCOUNT DTS_E_EXPREVALFNREPLICATEINVALIDREPEATCOUNT

The repeat count %1!d! is negative and is not valid for function "%2". The repeat count parameter cannot be negative.

DTS_E_EXPREVALFNSUBSTRINGINVALIDLENGTH DTS_E_EXPREVALFNSUBSTRINGINVALIDLENGTH DTS_E_EXPREVALFNSUBSTRINGINVALIDLENGTH

The length %1!d! is not valid for function "%2". The length parameter cannot be negative. Change the length parameter to zero or a positive value.

DTS_E_EXPREVALFNSUBSTRINGINVALIDSTARTINDEX DTS_E_EXPREVALFNSUBSTRINGINVALIDSTARTINDEX DTS_E_EXPREVALFNSUBSTRINGINVALIDSTARTINDEX

The start index %1!d! is not valid for function "%2". The start index value must be an integer greater than 0. Start index is one-based, not zero-based.

DTS_E_EXPREVALFNTOKEN_EMPTYDELIM DTS_E_EXPREVALFNTOKEN_EMPTYDELIM DTS_E_EXPREVALFNTOKEN_EMPTYDELIM

The expression value from token.

DTS_E_EXPREVALFUNCTIONCOMPUTEFAILED DTS_E_EXPREVALFUNCTIONCOMPUTEFAILED DTS_E_EXPREVALFUNCTIONCOMPUTEFAILED

Evaluating function "%1" failed with error code 0x%2!8.8X!.

DTS_E_EXPREVALFUNCTIONCONVERTPARAMTOMEMBERFAILED DTS_E_EXPREVALFUNCTIONCONVERTPARAMTOMEMBERFAILED DTS_E_EXPREVALFUNCTIONCONVERTPARAMTOMEMBERFAILED

The parameter number %1!d! of the function "%2" cannot be converted to a static value.

DTS_E_EXPREVALFUNCTIONOVERFLOW DTS_E_EXPREVALFUNCTIONOVERFLOW DTS_E_EXPREVALFUNCTIONOVERFLOW

The result of the function call "%1" is too large to fit in type "%2". The magnitude of the result of the function call overflows the type of the operand. An explicit cast to a larger type may be required.

DTS_E_EXPREVALFUNCTIONPARAMNOTSTATIC DTS_E_EXPREVALFUNCTIONPARAMNOTSTATIC DTS_E_EXPREVALFUNCTIONPARAMNOTSTATIC

The parameter number %1!d! of the function "%2" is not static. This parameter must be static, and cannot contain dynamic elements such as input columns.

DTS_E_EXPREVALILLEGALESCAPEINSTRINGLITERAL DTS_E_EXPREVALILLEGALESCAPEINSTRINGLITERAL DTS_E_EXPREVALILLEGALESCAPEINSTRINGLITERAL

The string literal "%1" contains an illegal escape sequence of "\%2!c!". The escape sequence is not supported in string literals in the expression evaluator. If a backslash is needed in the string, use a double backslash, "\\".

DTS_E_EXPREVALILLEGALHEXESCAPEINSTRINGLITERAL DTS_E_EXPREVALILLEGALHEXESCAPEINSTRINGLITERAL DTS_E_EXPREVALILLEGALHEXESCAPEINSTRINGLITERAL

The string literal "%1" contains an illegal hexadecimal escape sequence of "\x%2". The escape sequence is not supported in string literals in the expression evaluator. The hexadecimal escape sequences must be of the form \xhhhh where h is a valid hexadecimal digit.

DTS_E_EXPREVALINPUTCOLUMNIDNOTFOUND DTS_E_EXPREVALINPUTCOLUMNIDNOTFOUND DTS_E_EXPREVALINPUTCOLUMNIDNOTFOUND

The attempt to find the input column with lineage ID %1!d! failed with error code 0x%2!8.8X!. The input column was not found in the input column collection.

DTS_E_EXPREVALINPUTCOLUMNNAMENOTFOUND DTS_E_EXPREVALINPUTCOLUMNNAMENOTFOUND DTS_E_EXPREVALINPUTCOLUMNNAMENOTFOUND

The attempt to find the input column named "%1" failed with error code 0x%2!8.8X!. The input column specified was not found in the input column collection.

DTS_E_EXPREVALINVALIDCAST DTS_E_EXPREVALINVALIDCAST DTS_E_EXPREVALINVALIDCAST

Cannot cast expression "%1" from data type "%2" to data type "%3". The requested cast is not supported.

DTS_E_EXPREVALINVALIDCASTCODEPAGE DTS_E_EXPREVALINVALIDCASTCODEPAGE DTS_E_EXPREVALINVALIDCASTCODEPAGE

The value, %1!d!, specified for the code page parameter of the cast to data type "%2", is not valid. The code page is not installed on the machine.

DTS_E_EXPREVALINVALIDCASTLENGTH DTS_E_EXPREVALINVALIDCASTLENGTH DTS_E_EXPREVALINVALIDCASTLENGTH

The value %1!d! specified for the length parameter of the cast to data type %2 is negative and not valid. The length must be positive.

DTS_E_EXPREVALINVALIDCASTPARAM DTS_E_EXPREVALINVALIDCASTPARAM DTS_E_EXPREVALINVALIDCASTPARAM

The parameter number %1!d! of the cast to data type "%2" is not valid. The parameters of cast operators must be static, and cannot contain dynamic elements such as input columns.

DTS_E_EXPREVALINVALIDCASTPARAMTYPE DTS_E_EXPREVALINVALIDCASTPARAMTYPE DTS_E_EXPREVALINVALIDCASTPARAMTYPE

The parameter number %1!d! of the cast to data type "%2" is not an integer. A parameter of a cast operator must be an integer or a type that can be converted to an integer.

DTS_E_EXPREVALINVALIDCASTPRECISION DTS_E_EXPREVALINVALIDCASTPRECISION DTS_E_EXPREVALINVALIDCASTPRECISION

The value %1!d! specified for the precision parameter of the cast to data type "%2" is not valid. Precision must be in the range %3!d! to %4!d! and the precision value is out of range for the type cast.

DTS_E_EXPREVALINVALIDCASTSCALE DTS_E_EXPREVALINVALIDCASTSCALE DTS_E_EXPREVALINVALIDCASTSCALE

The value %1!d! specified for the scale parameter of the cast to data type "%2" is not valid. The scale must be in the range %3!d! to %4!d! and the scale value is out of range for the type cast. Scale must not exceed precision and must be positive.

DTS_E_EXPREVALINVALIDDATEPART DTS_E_EXPREVALINVALIDDATEPART DTS_E_EXPREVALINVALIDDATEPART

The "%1" is not a valid date part for function "%2".

DTS_E_EXPREVALINVALIDDATEPARTNODE DTS_E_EXPREVALINVALIDDATEPARTNODE DTS_E_EXPREVALINVALIDDATEPARTNODE

The date part parameter specified for function "%1" is not valid. It must be a static string. The date part parameter cannot contain dynamic elements, such as input columns, and must be of type DT_WSTR.

DTS_E_EXPREVALINVALIDFUNCTION DTS_E_EXPREVALINVALIDFUNCTION DTS_E_EXPREVALINVALIDFUNCTION

The function "%1" was not recognized. Either the function name is incorrect or does not exist.

DTS_E_EXPREVALINVALIDNULLCODEPAGE DTS_E_EXPREVALINVALIDNULLCODEPAGE DTS_E_EXPREVALINVALIDNULLCODEPAGE

The value %1!d! specified for the code page parameter of the NULL function with data type "%2" is not valid. The code page is not installed on the computer.

DTS_E_EXPREVALINVALIDNULLLENGTH DTS_E_EXPREVALINVALIDNULLLENGTH DTS_E_EXPREVALINVALIDNULLLENGTH

The value %1!d! specified for the length parameter of the "NULL" function with data type %2 is negative and not valid. The length must be positive.

DTS_E_EXPREVALINVALIDNULLPARAM DTS_E_EXPREVALINVALIDNULLPARAM DTS_E_EXPREVALINVALIDNULLPARAM

The parameter number %1!d! of the function NULL with data type "%2" is not valid. The parameters of NULL() must be static, and cannot contain dynamic elements such as input columns.

DTS_E_EXPREVALINVALIDNULLPARAMTYPE DTS_E_EXPREVALINVALIDNULLPARAMTYPE DTS_E_EXPREVALINVALIDNULLPARAMTYPE

The parameter number %1!d! of the function NULL with data type "%2" is not an integer. A parameter of NULL() must be an integer or a type that can be converted to an integer.

DTS_E_EXPREVALINVALIDNULLPRECISION DTS_E_EXPREVALINVALIDNULLPRECISION DTS_E_EXPREVALINVALIDNULLPRECISION

The value %1!d! specified for the precision parameter of the NULL function with data type "%2" is out of range. Precision must be in the range %3!d! to %4!d!.

DTS_E_EXPREVALINVALIDNULLSCALE DTS_E_EXPREVALINVALIDNULLSCALE DTS_E_EXPREVALINVALIDNULLSCALE

The value %1!d! specified for the scale parameter of the NULL function with data type %2 is out of range. Scale must be in the range %3!d! to %4!d!. Scale must not exceed precision and must not be negative.

DTS_E_EXPREVALINVALIDNUMBEROFPARAMSPLURALPLURAL DTS_E_EXPREVALINVALIDNUMBEROFPARAMSPLURALPLURAL DTS_E_EXPREVALINVALIDNUMBEROFPARAMSPLURALPLURAL

The function "%1" requires %2!d! parameters, not %3!d! parameters. The function name was recognized, but the number of parameters is not valid.

DTS_E_EXPREVALINVALIDNUMBEROFPARAMSPLURALSINGULAR DTS_E_EXPREVALINVALIDNUMBEROFPARAMSPLURALSINGULAR DTS_E_EXPREVALINVALIDNUMBEROFPARAMSPLURALSINGULAR

The function "%1" requires %2!d! parameters, not %3!d! parameter. The function name was recognized, but the number of parameters is not valid.

DTS_E_EXPREVALINVALIDNUMBEROFPARAMSSINGULARPLURAL DTS_E_EXPREVALINVALIDNUMBEROFPARAMSSINGULARPLURAL DTS_E_EXPREVALINVALIDNUMBEROFPARAMSSINGULARPLURAL

The function "%1" requires %2!d! parameter, not %3!d! parameters. The function name was recognized, but the number of parameters is not valid.

DTS_E_EXPREVALINVALIDTOKEN DTS_E_EXPREVALINVALIDTOKEN DTS_E_EXPREVALINVALIDTOKEN

The attempt to parse the expression "%1" failed. The token "%2" at line number "%3", character number "%4" was not recognized. The expression cannot be parsed because it contains invalid elements at the location specified.

DTS_E_EXPREVALINVALIDTOKENSINGLEEQUAL DTS_E_EXPREVALINVALIDTOKENSINGLEEQUAL DTS_E_EXPREVALINVALIDTOKENSINGLEEQUAL

The parsing the expression "%1" failed. The equal sign (=) at line number "%2", character number "%3", was not expected. A double equals sign (==) may be required at the location specified.

DTS_E_EXPREVALINVALIDTOKENSINGLEQUOTE DTS_E_EXPREVALINVALIDTOKENSINGLEQUOTE DTS_E_EXPREVALINVALIDTOKENSINGLEQUOTE

The parsing the expression "%1" failed. The single quotation mark at line number "%2", character number "%3", was not expected.

DTS_E_EXPREVALINVALIDTOKENSTATE DTS_E_EXPREVALINVALIDTOKENSTATE DTS_E_EXPREVALINVALIDTOKENSTATE

The attempt to parse the expression "%1" failed. The expression might contain an invalid token, an incomplete token, or an invalid element. It might not be well-formed, or might be missing part of a required element such as a parenthesis.

DTS_E_EXPREVALLITERALOVERFLOW DTS_E_EXPREVALLITERALOVERFLOW DTS_E_EXPREVALLITERALOVERFLOW

The literal "%1" is too large to fit into type %2. The magnitude of the literal overflows the type.

DTS_E_EXPREVALLNINVALIDPARAM DTS_E_EXPREVALLNINVALIDPARAM DTS_E_EXPREVALLNINVALIDPARAM

The function LN cannot operate on zero or negative values, and a zero or negative value was passed to the LN function.

DTS_E_EXPREVALLOGINVALIDPARAM DTS_E_EXPREVALLOGINVALIDPARAM DTS_E_EXPREVALLOGINVALIDPARAM

The function LOG cannot operate on zero or negative values, and a zero or negative value was passed to the LOG function.

DTS_E_EXPREVALNOINPUTCOLUMNCOLLECTIONFORCOLUMNID DTS_E_EXPREVALNOINPUTCOLUMNCOLLECTIONFORCOLUMNID DTS_E_EXPREVALNOINPUTCOLUMNCOLLECTIONFORCOLUMNID

The expression contains unrecognized token "#%1!d!".

DTS_E_EXPREVALNOINPUTCOLUMNCOLLECTIONFORCOLUMNNAME DTS_E_EXPREVALNOINPUTCOLUMNCOLLECTIONFORCOLUMNNAME DTS_E_EXPREVALNOINPUTCOLUMNCOLLECTIONFORCOLUMNNAME

The expression contains unrecognized token "%1". If "%1" is a variable, it should be expressed as "@%1". The specified token is not valid. If the token is intended to be a variable name, it should be prefixed with the @ symbol.

DTS_E_EXPREVALPARAMTYPEMISMATCH DTS_E_EXPREVALPARAMTYPEMISMATCH DTS_E_EXPREVALPARAMTYPEMISMATCH

The function "%1" does not support the data type "%2" for parameter number %3!d!. The type of the parameter could not be implicitly cast into a compatible type for the function. To perform this operation, the operand needs to be explicitly cast with a cast operator.

DTS_E_EXPREVALPLACEHOLDERINEXPRESSION DTS_E_EXPREVALPLACEHOLDERINEXPRESSION DTS_E_EXPREVALPLACEHOLDERINEXPRESSION

The placeholder "%1" was found in an expression. This must be replaced with an actual parameter or operand.

DTS_E_EXPREVALPOWERINVALIDPARAM DTS_E_EXPREVALPOWERINVALIDPARAM DTS_E_EXPREVALPOWERINVALIDPARAM

The parameters passed to the function POWER cannot be evaluated and yield an indeterminate result.

DTS_E_EXPREVALRESULTTYPECONVERSIONFAILED DTS_E_EXPREVALRESULTTYPECONVERSIONFAILED DTS_E_EXPREVALRESULTTYPECONVERSIONFAILED

The conversion of the result of the expression"%1" from type "%2" to a supported type failed with error code 0x%3!8.8X!. An unexpected error occurred when trying to convert the expression result to a type supported by the runtime engine, even though the type conversion is supported.

DTS_E_EXPREVALRESULTTYPENOTSUPPORTED DTS_E_EXPREVALRESULTTYPENOTSUPPORTED DTS_E_EXPREVALRESULTTYPENOTSUPPORTED

The expression "%1" has a result type of "%2", which cannot be converted to a supported type.

DTS_E_EXPREVALSENSITIVEERROR DTS_E_EXPREVALSENSITIVEERROR DTS_E_EXPREVALSENSITIVEERROR

A sensitive error occurred during the evaluation of the expression.

DTS_E_EXPREVALSQRTINVALIDPARAM DTS_E_EXPREVALSQRTINVALIDPARAM DTS_E_EXPREVALSQRTINVALIDPARAM

The function SQRT cannot operate on negative values, and a negative value was passed to the SQRT function.

DTS_E_EXPREVALSTATIC_AMBIGUOUSINPUTCOLUMNNAME DTS_E_EXPREVALSTATIC_AMBIGUOUSINPUTCOLUMNNAME DTS_E_EXPREVALSTATIC_AMBIGUOUSINPUTCOLUMNNAME

An ambiguous input column name was specified. The column must be qualified as [Component Name].[Column Name] or referenced by lineage ID. This error occurs when the input column exists on more than one component, and must be differentiated by the addition of component name or by using the lineage ID.

DTS_E_EXPREVALSTATIC_AMBIGUOUSVARIABLENNAME DTS_E_EXPREVALSTATIC_AMBIGUOUSVARIABLENNAME DTS_E_EXPREVALSTATIC_AMBIGUOUSVARIABLENNAME

An ambiguous variable name was specified. The desired variable must be qualified as @[Namespace::Variable]. This error occurs when the variable exists in more than one namespace.

DTS_E_EXPREVALSTATIC_BINARYOPDTSTRNOTSUPPORTED DTS_E_EXPREVALSTATIC_BINARYOPDTSTRNOTSUPPORTED DTS_E_EXPREVALSTATIC_BINARYOPDTSTRNOTSUPPORTED

For operands of binary operation, the data type DT_STR is only supported for input columns and cast operations. A DT_STR operand that is not an input column or the result of a cast cannot be used with a binary operation. To perform this operation, the operand needs to be explicitly cast with a cast operator.

DTS_E_EXPREVALSTATIC_BINARYOPERATIONFAILED DTS_E_EXPREVALSTATIC_BINARYOPERATIONFAILED DTS_E_EXPREVALSTATIC_BINARYOPERATIONFAILED

A binary operation failed. There was an out-of-memory condition, or an internal error occurred.

DTS_E_EXPREVALSTATIC_BINARYOPERATIONSETTYPEFAILED DTS_E_EXPREVALSTATIC_BINARYOPERATIONSETTYPEFAILED DTS_E_EXPREVALSTATIC_BINARYOPERATIONSETTYPEFAILED

Setting the result type of a binary operation failed.

DTS_E_EXPREVALSTATIC_BINARYOPERATORCODEPAGEMISMATCH DTS_E_EXPREVALSTATIC_BINARYOPERATORCODEPAGEMISMATCH DTS_E_EXPREVALSTATIC_BINARYOPERATORCODEPAGEMISMATCH

The code pages do not match in a binary operation. The code page of the left operand does not match the code page of the right operand. For this binary operation, the code pages must be the same.

DTS_E_EXPREVALSTATIC_BINARYOPNUMERICOVERFLOW DTS_E_EXPREVALSTATIC_BINARYOPNUMERICOVERFLOW DTS_E_EXPREVALSTATIC_BINARYOPNUMERICOVERFLOW

The result of a binary operation was too big for the maximum size for numeric types. The operand types could not be implicitly cast into a numeric (DT_NUMERIC) result without loss of precision or scale. To perform this operation, one or both operands need to be explicitly cast with a cast operator.

DTS_E_EXPREVALSTATIC_BINARYOPOVERFLOW DTS_E_EXPREVALSTATIC_BINARYOPOVERFLOW DTS_E_EXPREVALSTATIC_BINARYOPOVERFLOW

The magnitude of the result of a binary operation overflows the maximum size for result data type.

DTS_E_EXPREVALSTATIC_BINARYSIGNMISMATCH DTS_E_EXPREVALSTATIC_BINARYSIGNMISMATCH DTS_E_EXPREVALSTATIC_BINARYSIGNMISMATCH

There is a sign mismatch for the bitwise binary operator. The operands for this operator must be both positive or both negative.

DTS_E_EXPREVALSTATIC_BINARYTYPEMISMATCH DTS_E_EXPREVALSTATIC_BINARYTYPEMISMATCH DTS_E_EXPREVALSTATIC_BINARYTYPEMISMATCH

Incompatible data types were used with a binary operator. The operand types could not be implicitly cast into compatible types for the operation. To perform this operation, one or both operands need to be explicitly cast with a cast operator.

DTS_E_EXPREVALSTATIC_BUILDSTRINGFAILED DTS_E_EXPREVALSTATIC_BUILDSTRINGFAILED DTS_E_EXPREVALSTATIC_BUILDSTRINGFAILED

The attempt to generate a string representation of the expression failed.

DTS_E_EXPREVALSTATIC_CANNOTCONVERTRESULT DTS_E_EXPREVALSTATIC_CANNOTCONVERTRESULT DTS_E_EXPREVALSTATIC_CANNOTCONVERTRESULT

The expression result data type cannot be converted to the column data type. The result of the expression should be written to an input/output column, but the data type of the expression cannot be converted to the data type of the column.

DTS_E_EXPREVALSTATIC_CASTCODEPAGEMISMATCH DTS_E_EXPREVALSTATIC_CASTCODEPAGEMISMATCH DTS_E_EXPREVALSTATIC_CASTCODEPAGEMISMATCH

The expression cannot be casted because the code page of the value being cast does not match the requested result code page. The code page of the source must match the code page requested for the destination.

DTS_E_EXPREVALSTATIC_CASTFAILED DTS_E_EXPREVALSTATIC_CASTFAILED DTS_E_EXPREVALSTATIC_CASTFAILED

An error occurred while attempting to perform a type cast.

DTS_E_EXPREVALSTATIC_CHARMAPPINGFAILED DTS_E_EXPREVALSTATIC_CHARMAPPINGFAILED DTS_E_EXPREVALSTATIC_CHARMAPPINGFAILED

A character mapping function failed.

DTS_E_EXPREVALSTATIC_COMPUTATIONFAILED DTS_E_EXPREVALSTATIC_COMPUTATIONFAILED DTS_E_EXPREVALSTATIC_COMPUTATIONFAILED

An error occurred during computation of the expression.

DTS_E_EXPREVALSTATIC_COMPUTEFAILED DTS_E_EXPREVALSTATIC_COMPUTEFAILED DTS_E_EXPREVALSTATIC_COMPUTEFAILED

An attempt to compute the expression failed.

DTS_E_EXPREVALSTATIC_CONDITIONALOPCODEPAGEMISMATCH DTS_E_EXPREVALSTATIC_CONDITIONALOPCODEPAGEMISMATCH DTS_E_EXPREVALSTATIC_CONDITIONALOPCODEPAGEMISMATCH

The code pages do not match in a conditional operation. The code page of the left operand does not match the code page of the right operand. For the conditional operator of that type, the code pages must be the same.

DTS_E_EXPREVALSTATIC_CONDITIONALOPDTSTRNOTSUPPORTED DTS_E_EXPREVALSTATIC_CONDITIONALOPDTSTRNOTSUPPORTED DTS_E_EXPREVALSTATIC_CONDITIONALOPDTSTRNOTSUPPORTED

For operands of the conditional operator, the data type DT_STR is only supported for input columns and cast operations. A DT_STR operand that is not an input column or the result of a cast cannot be used with the conditional operation. To perform this operation, the operand needs to be explicitly cast with a cast operator.

DTS_E_EXPREVALSTATIC_CONDITIONALOPERATIONFAILED DTS_E_EXPREVALSTATIC_CONDITIONALOPERATIONFAILED DTS_E_EXPREVALSTATIC_CONDITIONALOPERATIONFAILED

The conditional operation failed.

DTS_E_EXPREVALSTATIC_CONDITIONALOPINVALIDCONDITIONTYPE DTS_E_EXPREVALSTATIC_CONDITIONALOPINVALIDCONDITIONTYPE DTS_E_EXPREVALSTATIC_CONDITIONALOPINVALIDCONDITIONTYPE

The conditional expression of the conditional operator has invalid data type. The conditional expression must be of type DT_BOOL.

DTS_E_EXPREVALSTATIC_CONDITIONALOPSETTYPEFAILED DTS_E_EXPREVALSTATIC_CONDITIONALOPSETTYPEFAILED DTS_E_EXPREVALSTATIC_CONDITIONALOPSETTYPEFAILED

Setting the result type of a conditional operation failed.

DTS_E_EXPREVALSTATIC_CONDITIONALOPTYPEMISMATCH DTS_E_EXPREVALSTATIC_CONDITIONALOPTYPEMISMATCH DTS_E_EXPREVALSTATIC_CONDITIONALOPTYPEMISMATCH

The data types of the operands of the conditional operator were incompatible. The operand types could not be implicitly cast into compatible types for the conditional operation. To perform this operation, one or both operands need to be explicitly cast with a cast operator.

DTS_E_EXPREVALSTATIC_DATACONVERSIONFAILED DTS_E_EXPREVALSTATIC_DATACONVERSIONFAILED DTS_E_EXPREVALSTATIC_DATACONVERSIONFAILED

An error occurred while attempting to perform data conversion. The source type could not be converted to the destination type.

DTS_E_EXPREVALSTATIC_DATACONVERSIONNOTSUPPORTED DTS_E_EXPREVALSTATIC_DATACONVERSIONNOTSUPPORTED DTS_E_EXPREVALSTATIC_DATACONVERSIONNOTSUPPORTED

The expression contains an unsupported data type conversion. The source type cannot be converted to the destination type.

DTS_E_EXPREVALSTATIC_DATACONVERSIONOVERFLOW DTS_E_EXPREVALSTATIC_DATACONVERSIONOVERFLOW DTS_E_EXPREVALSTATIC_DATACONVERSIONOVERFLOW

An overflow occurred while converting between data types. The source type is too large to fit in the destination type.

DTS_E_EXPREVALSTATIC_DIVBYZERO DTS_E_EXPREVALSTATIC_DIVBYZERO DTS_E_EXPREVALSTATIC_DIVBYZERO

A division by zero occurred in the expression.

DTS_E_EXPREVALSTATIC_FAILEDTOCONVERTSTRCOLUMNTOWSTR DTS_E_EXPREVALSTATIC_FAILEDTOCONVERTSTRCOLUMNTOWSTR DTS_E_EXPREVALSTATIC_FAILEDTOCONVERTSTRCOLUMNTOWSTR

Converting an input column from type DT_STR to type DT_WSTR failed. An error occurred while performing the implicit conversion on the input column.

DTS_E_EXPREVALSTATIC_FAILEDTOPARSEEXPRESSION DTS_E_EXPREVALSTATIC_FAILEDTOPARSEEXPRESSION DTS_E_EXPREVALSTATIC_FAILEDTOPARSEEXPRESSION

The expression is not valid and could not be parsed. It might contain invalid elements, or it might not be well-formed.

DTS_E_EXPREVALSTATIC_FNFINDSTRINGINVALIDOCCURRENCECOUNT DTS_E_EXPREVALSTATIC_FNFINDSTRINGINVALIDOCCURRENCECOUNT DTS_E_EXPREVALSTATIC_FNFINDSTRINGINVALIDOCCURRENCECOUNT

The occurrence count parameter is not valid for function FINDSTRING. This parameter must be greater than zero.

DTS_E_EXPREVALSTATIC_FNREPLICATEINVALIDREPEATCOUNT DTS_E_EXPREVALSTATIC_FNREPLICATEINVALIDREPEATCOUNT DTS_E_EXPREVALSTATIC_FNREPLICATEINVALIDREPEATCOUNT

The repeat count parameter is not valid for function REPLICATE. This parameter cannot be negative.

DTS_E_EXPREVALSTATIC_FNRIGHTINVALIDLENGTH DTS_E_EXPREVALSTATIC_FNRIGHTINVALIDLENGTH DTS_E_EXPREVALSTATIC_FNRIGHTINVALIDLENGTH

The length parameter is not valid for function RIGHT. The length parameter cannot be negative.

DTS_E_EXPREVALSTATIC_FNSUBSTRINGINVALIDLENGTH DTS_E_EXPREVALSTATIC_FNSUBSTRINGINVALIDLENGTH DTS_E_EXPREVALSTATIC_FNSUBSTRINGINVALIDLENGTH

The length parameter was not valid for function SUBSTRING. The length parameter cannot be negative.

DTS_E_EXPREVALSTATIC_FNSUBSTRINGINVALIDSTARTINDEX DTS_E_EXPREVALSTATIC_FNSUBSTRINGINVALIDSTARTINDEX DTS_E_EXPREVALSTATIC_FNSUBSTRINGINVALIDSTARTINDEX

The start index was not valid for function SUBSTRING. The start index value must be an integer greater than zero. The start index is 1-based, not 0-based.

DTS_E_EXPREVALSTATIC_FUNCTIONCOMPUTEFAILED DTS_E_EXPREVALSTATIC_FUNCTIONCOMPUTEFAILED DTS_E_EXPREVALSTATIC_FUNCTIONCOMPUTEFAILED

An error occurred while evaluating the function.

DTS_E_EXPREVALSTATIC_FUNCTIONCONVERTPARAMTOMEMBERFAILED DTS_E_EXPREVALSTATIC_FUNCTIONCONVERTPARAMTOMEMBERFAILED DTS_E_EXPREVALSTATIC_FUNCTIONCONVERTPARAMTOMEMBERFAILED

A function parameter cannot be converted to a static value. The parameter must be static and cannot contain dynamic elements such as input columns.

DTS_E_EXPREVALSTATIC_FUNCTIONOVERFLOW DTS_E_EXPREVALSTATIC_FUNCTIONOVERFLOW DTS_E_EXPREVALSTATIC_FUNCTIONOVERFLOW

The magnitude of the result of a function call was too big to fit in the result type, and overflowed the type of the operand. An explicit cast to a larger type may be required.

DTS_E_EXPREVALSTATIC_FUNCTIONPARAMNOTSTATIC DTS_E_EXPREVALSTATIC_FUNCTIONPARAMNOTSTATIC DTS_E_EXPREVALSTATIC_FUNCTIONPARAMNOTSTATIC

An invalid parameter was given for a function. This parameter must be static and cannot contain dynamic elements such as input columns.

DTS_E_EXPREVALSTATIC_ILLEGALESCAPEINSTRINGLITERAL DTS_E_EXPREVALSTATIC_ILLEGALESCAPEINSTRINGLITERAL DTS_E_EXPREVALSTATIC_ILLEGALESCAPEINSTRINGLITERAL

The string literal contains an illegal escape sequence. The escape sequence is not supported in string literals in the expression evaluator. If a backslash is needed in the string, format it as a double backslash, "\\".

DTS_E_EXPREVALSTATIC_ILLEGALHEXESCAPEINSTRINGLITERAL DTS_E_EXPREVALSTATIC_ILLEGALHEXESCAPEINSTRINGLITERAL DTS_E_EXPREVALSTATIC_ILLEGALHEXESCAPEINSTRINGLITERAL

A string literal contains an illegal hexadecimal escape sequence. The escape sequence is not supported in string literals in the expression evaluator. Hexadecimal escape sequences must be of the form \xhhhh where h is a valid hexadecimal digit.

DTS_E_EXPREVALSTATIC_INPUTCOLUMNIDNOTFOUND DTS_E_EXPREVALSTATIC_INPUTCOLUMNIDNOTFOUND DTS_E_EXPREVALSTATIC_INPUTCOLUMNIDNOTFOUND

An attempt to find an input column by lineage ID failed. The input column was not found in the input column collection.

DTS_E_EXPREVALSTATIC_INPUTCOLUMNNAMENOTFOUND DTS_E_EXPREVALSTATIC_INPUTCOLUMNNAMENOTFOUND DTS_E_EXPREVALSTATIC_INPUTCOLUMNNAMENOTFOUND

The input column specified was not found in the input column collection.

DTS_E_EXPREVALSTATIC_INVALIDCAST DTS_E_EXPREVALSTATIC_INVALIDCAST DTS_E_EXPREVALSTATIC_INVALIDCAST

The expression contained an unsupported type cast.

DTS_E_EXPREVALSTATIC_INVALIDCASTCODEPAGE DTS_E_EXPREVALSTATIC_INVALIDCASTCODEPAGE DTS_E_EXPREVALSTATIC_INVALIDCASTCODEPAGE

The value specified for the code page parameter of the cast to data type DT_STR or DT_TEXT is not valid. The specified code page is not installed on the computer.

DTS_E_EXPREVALSTATIC_INVALIDCASTLENGTH DTS_E_EXPREVALSTATIC_INVALIDCASTLENGTH DTS_E_EXPREVALSTATIC_INVALIDCASTLENGTH

The value specified for the length parameter of a cast operation is not valid. The length must be positive. The length specified for the type cast is negative. Change to a positive value.

DTS_E_EXPREVALSTATIC_INVALIDCASTPARAM DTS_E_EXPREVALSTATIC_INVALIDCASTPARAM DTS_E_EXPREVALSTATIC_INVALIDCASTPARAM

An invalid parameter was given for a cast operation. Parameters of cast operators must be static, and cannot contain dynamic elements such as input columns.

DTS_E_EXPREVALSTATIC_INVALIDCASTPARAMTYPE DTS_E_EXPREVALSTATIC_INVALIDCASTPARAMTYPE DTS_E_EXPREVALSTATIC_INVALIDCASTPARAMTYPE

An invalid parameter was given for a cast operation. A parameter of a cast operator must be an integer, or a type that can be converted to an integer.

DTS_E_EXPREVALSTATIC_INVALIDCASTPRECISION DTS_E_EXPREVALSTATIC_INVALIDCASTPRECISION DTS_E_EXPREVALSTATIC_INVALIDCASTPRECISION

The value specified for the precision parameter of a cast operation is out of range for the type cast.

DTS_E_EXPREVALSTATIC_INVALIDCASTSCALE DTS_E_EXPREVALSTATIC_INVALIDCASTSCALE DTS_E_EXPREVALSTATIC_INVALIDCASTSCALE

The value specified for the scale parameter of a cast operation is out of range for the type cast. Scale must not exceed precision and must not be negative.

DTS_E_EXPREVALSTATIC_INVALIDDATEPART DTS_E_EXPREVALSTATIC_INVALIDDATEPART DTS_E_EXPREVALSTATIC_INVALIDDATEPART

An unrecognized date part parameter was specified for a date function.

DTS_E_EXPREVALSTATIC_INVALIDDATEPARTNODE DTS_E_EXPREVALSTATIC_INVALIDDATEPARTNODE DTS_E_EXPREVALSTATIC_INVALIDDATEPARTNODE

The "date part" parameter specified for a date function is not valid. "Date part" parameters must be static strings, and cannot contain dynamic elements such as input columns. They must be of type DT_WSTR.

DTS_E_EXPREVALSTATIC_INVALIDFUNCTION DTS_E_EXPREVALSTATIC_INVALIDFUNCTION DTS_E_EXPREVALSTATIC_INVALIDFUNCTION

An invalid function name appeared in the expression. Verify that the function name is correct and does exist.

DTS_E_EXPREVALSTATIC_INVALIDNULLCODEPAGE DTS_E_EXPREVALSTATIC_INVALIDNULLCODEPAGE DTS_E_EXPREVALSTATIC_INVALIDNULLCODEPAGE

The value specified for the code page parameter of the NULL function with data type DT_STR or DT_TEXT is not valid. The code page specified is not installed on the computer. Either change the code page that is specified, or install the code page on the computer.

DTS_E_EXPREVALSTATIC_INVALIDNULLLENGTH DTS_E_EXPREVALSTATIC_INVALIDNULLLENGTH DTS_E_EXPREVALSTATIC_INVALIDNULLLENGTH

The value specified for the length parameter of a NULL function is not valid. The length must be positive. The length specified for the NULL function is negative. Change to a positive value.

DTS_E_EXPREVALSTATIC_INVALIDNULLPARAM DTS_E_EXPREVALSTATIC_INVALIDNULLPARAM DTS_E_EXPREVALSTATIC_INVALIDNULLPARAM

An invalid parameter was given for function NULL. The parameters of NULL must be static, and cannot contain dynamic elements such as input columns.

DTS_E_EXPREVALSTATIC_INVALIDNULLPARAMTYPE DTS_E_EXPREVALSTATIC_INVALIDNULLPARAMTYPE DTS_E_EXPREVALSTATIC_INVALIDNULLPARAMTYPE

An invalid parameter was given for function NULL. A parameter of NULL must be an integer, or a type that can be converted to an integer.

DTS_E_EXPREVALSTATIC_INVALIDNULLPRECISION DTS_E_EXPREVALSTATIC_INVALIDNULLPRECISION DTS_E_EXPREVALSTATIC_INVALIDNULLPRECISION

The value specified for the precision parameter of a NULL function is not valid. The precision that was specified is out of range for the NULL function.

DTS_E_EXPREVALSTATIC_INVALIDNULLSCALE DTS_E_EXPREVALSTATIC_INVALIDNULLSCALE DTS_E_EXPREVALSTATIC_INVALIDNULLSCALE

The value specified for the scale parameter of a NULL function is not valid. The scale that was specified is out of range for the NULL function. Scale must not exceed precision and must be positive.

DTS_E_EXPREVALSTATIC_INVALIDNUMBEROFPARAMS DTS_E_EXPREVALSTATIC_INVALIDNUMBEROFPARAMS DTS_E_EXPREVALSTATIC_INVALIDNUMBEROFPARAMS

An incorrect number of parameters was given to a function. The function name was recognized, but the number of parameters was not correct.

DTS_E_EXPREVALSTATIC_INVALIDTOKEN DTS_E_EXPREVALSTATIC_INVALIDTOKEN DTS_E_EXPREVALSTATIC_INVALIDTOKEN

The expression contained a token that was not recognized. The expression could not be parsed because it contains invalid elements.

DTS_E_EXPREVALSTATIC_INVALIDTOKENSINGLEEQUAL DTS_E_EXPREVALSTATIC_INVALIDTOKENSINGLEEQUAL DTS_E_EXPREVALSTATIC_INVALIDTOKENSINGLEEQUAL

The expression contains an unexpected equal sign (=). This error usually occurs when a double equals sign (==) is needed.

DTS_E_EXPREVALSTATIC_INVALIDTOKENSINGLEQUOTE DTS_E_EXPREVALSTATIC_INVALIDTOKENSINGLEQUOTE DTS_E_EXPREVALSTATIC_INVALIDTOKENSINGLEQUOTE

The expression contains an unexpected single quotation mark. A double quotation mark may be required.

DTS_E_EXPREVALSTATIC_INVALIDTOKENSTATE DTS_E_EXPREVALSTATIC_INVALIDTOKENSTATE DTS_E_EXPREVALSTATIC_INVALIDTOKENSTATE

An attempt to parse the expression failed. The expression contains an invalid or incomplete token. It may contain invalid elements, be missing part of a required element such as closing parentheses, or may not be well formed.

DTS_E_EXPREVALSTATIC_LITERALOVERFLOW DTS_E_EXPREVALSTATIC_LITERALOVERFLOW DTS_E_EXPREVALSTATIC_LITERALOVERFLOW

The magnitude of the literal value was too big to fit in the type requested.

DTS_E_EXPREVALSTATIC_NOINPUTCOLUMNCOLLECTION DTS_E_EXPREVALSTATIC_NOINPUTCOLUMNCOLLECTION DTS_E_EXPREVALSTATIC_NOINPUTCOLUMNCOLLECTION

The expression contains an unrecognized token that appears to be an input column reference, but the input column collection is not available to process input columns. The input column collection has not been provided to the expression evaluator, but an input column was included in the expression.

DTS_E_EXPREVALSTATIC_PARAMTYPEMISMATCH DTS_E_EXPREVALSTATIC_PARAMTYPEMISMATCH DTS_E_EXPREVALSTATIC_PARAMTYPEMISMATCH

A function has a parameter with an unsupported data type. The type of the parameter cannot be implicitly cast into a compatible type for the function. To perform this operation, the operand needs to be explicitly cast with a cast operator.

DTS_E_EXPREVALSTATIC_PLACEHOLDERINEXPRESSION DTS_E_EXPREVALSTATIC_PLACEHOLDERINEXPRESSION DTS_E_EXPREVALSTATIC_PLACEHOLDERINEXPRESSION

A placeholder function parameter or operand was found in an expression. This should be replaced with an actual parameter or operand.

DTS_E_EXPREVALSTATIC_STRINGCOMPARISONFAILED DTS_E_EXPREVALSTATIC_STRINGCOMPARISONFAILED DTS_E_EXPREVALSTATIC_STRINGCOMPARISONFAILED

The two strings cannot be compared.

DTS_E_EXPREVALSTATIC_UNARYOPERATIONFAILED DTS_E_EXPREVALSTATIC_UNARYOPERATIONFAILED DTS_E_EXPREVALSTATIC_UNARYOPERATIONFAILED

A unary operation failed. An out-of-memory condition occurred, or there was an internal error.

DTS_E_EXPREVALSTATIC_UNARYOPERATIONSETTYPEFAILED DTS_E_EXPREVALSTATIC_UNARYOPERATIONSETTYPEFAILED DTS_E_EXPREVALSTATIC_UNARYOPERATIONSETTYPEFAILED

Setting the result type of a unary operation failed.

DTS_E_EXPREVALSTATIC_UNARYOPOVERFLOW DTS_E_EXPREVALSTATIC_UNARYOPOVERFLOW DTS_E_EXPREVALSTATIC_UNARYOPOVERFLOW

The result of a unary minus (negation) operation overflowed the maximum size for result data type. The magnitude of the result of the operation overflows the type of the result.

DTS_E_EXPREVALSTATIC_UNSUPPORTEDBINARYTYPE DTS_E_EXPREVALSTATIC_UNSUPPORTEDBINARYTYPE DTS_E_EXPREVALSTATIC_UNSUPPORTEDBINARYTYPE

An unsupported data type was used with a binary operator. The type of one, or both, of the operands is not supported for the operation. To perform this operation, one or both operands need to be explicitly cast with a cast operator.

DTS_E_EXPREVALSTATIC_UNSUPPORTEDTYPE DTS_E_EXPREVALSTATIC_UNSUPPORTEDTYPE DTS_E_EXPREVALSTATIC_UNSUPPORTEDTYPE

An unsupported or unrecognized data type was used in the expression.

DTS_E_EXPREVALSTATIC_UNSUPPORTEDUNNARYTYPE DTS_E_EXPREVALSTATIC_UNSUPPORTEDUNNARYTYPE DTS_E_EXPREVALSTATIC_UNSUPPORTEDUNNARYTYPE

An unsupported data type is used with a unary operator. The operand type is not supported for the operation. To perform this operation, the operand needs to be explicitly cast with a cast operator.

DTS_E_EXPREVALSTATIC_VARIABLECOMPUTEFAILED DTS_E_EXPREVALSTATIC_VARIABLECOMPUTEFAILED DTS_E_EXPREVALSTATIC_VARIABLECOMPUTEFAILED

Retrieving the value for a variable failed.

DTS_E_EXPREVALSTATIC_VARIABLENOTFOUND DTS_E_EXPREVALSTATIC_VARIABLENOTFOUND DTS_E_EXPREVALSTATIC_VARIABLENOTFOUND

A variable specified was not found in the collection. It might not exist in the correct scope. Verify that the variable exists and that the scope is correct.

DTS_E_EXPREVALSTATIC_VARIABLETYPENOTSUPPORTED DTS_E_EXPREVALSTATIC_VARIABLETYPENOTSUPPORTED DTS_E_EXPREVALSTATIC_VARIABLETYPENOTSUPPORTED

The expression contains a variable with an unsupported data type.

DTS_E_EXPREVALSTRINGCOMPARISONFAILED DTS_E_EXPREVALSTRINGCOMPARISONFAILED DTS_E_EXPREVALSTRINGCOMPARISONFAILED

Comparing "%1" to string "%2" failed.

DTS_E_EXPREVALSTRINGLITERALTOOLONG DTS_E_EXPREVALSTRINGLITERALTOOLONG DTS_E_EXPREVALSTRINGLITERALTOOLONG

A string literal in the expression exceeds the maximum allowed length of %1!d! characters.

DTS_E_EXPREVALSTRINGVARIABLETOOLONG DTS_E_EXPREVALSTRINGVARIABLETOOLONG DTS_E_EXPREVALSTRINGVARIABLETOOLONG

The variable %1 contains a string that exceeds the maximum allowed length of %2!d! characters.

DTS_E_EXPREVALTRUNCATIONASERROR DTS_E_EXPREVALTRUNCATIONASERROR DTS_E_EXPREVALTRUNCATIONASERROR

A truncation occurred during evaluation of the expression.

DTS_E_EXPREVALUNARYOPERATIONFAILED DTS_E_EXPREVALUNARYOPERATIONFAILED DTS_E_EXPREVALUNARYOPERATIONFAILED

The unary operation "%1" failed with error code 0x%2!8.8X!. An internal error occurred, or there is an out-of-memory condition.

DTS_E_EXPREVALUNARYOPERATIONSETTYPEFAILED DTS_E_EXPREVALUNARYOPERATIONSETTYPEFAILED DTS_E_EXPREVALUNARYOPERATIONSETTYPEFAILED

An attempt to set the result type of unary operation "%1" failed with error code 0x%2!8.8X!.

DTS_E_EXPREVALUNARYOPOVERFLOW DTS_E_EXPREVALUNARYOPOVERFLOW DTS_E_EXPREVALUNARYOPOVERFLOW

The result of the unary minus (negation) operation "%1" exceeds the maximum size for result data type "%2". The magnitude of the result of the operation overflows the type of the result.

DTS_E_EXPREVALUNEXPECTEDPARSEERROR DTS_E_EXPREVALUNEXPECTEDPARSEERROR DTS_E_EXPREVALUNEXPECTEDPARSEERROR

An error occurred when parsing the expression "%1". The expression failed to parse for an unknown reason.

DTS_E_EXPREVALUNSUPPORTEDBINARYTYPE DTS_E_EXPREVALUNSUPPORTEDBINARYTYPE DTS_E_EXPREVALUNSUPPORTEDBINARYTYPE

The data type "%1" cannot be used with binary operator "%2". The type of one or both of the operands is not supported for the operation. To perform this operation, one or both operands need to be explicitly cast with a cast operator.

DTS_E_EXPREVALUNSUPPORTEDTYPE DTS_E_EXPREVALUNSUPPORTEDTYPE DTS_E_EXPREVALUNSUPPORTEDTYPE

The data type "%1" is not supported in an expression. The specified type is not supported or is not valid.

DTS_E_EXPREVALUNSUPPORTEDUNNARYTYPE DTS_E_EXPREVALUNSUPPORTEDUNNARYTYPE DTS_E_EXPREVALUNSUPPORTEDUNNARYTYPE

The data type "%1" cannot be used with unary operator "%2". This operand type is not supported for the operation. To perform this operation, the operand needs to be explicitly cast with a cast operator.

DTS_E_EXPREVALVARIABLECOMPUTEFAILED DTS_E_EXPREVALVARIABLECOMPUTEFAILED DTS_E_EXPREVALVARIABLECOMPUTEFAILED

Retrieving the value of Variable "%1" failed with error code 0x%2!8.8X!.

DTS_E_EXPREVALVARIABLECOULDNOTBEREAD DTS_E_EXPREVALVARIABLECOULDNOTBEREAD DTS_E_EXPREVALVARIABLECOULDNOTBEREAD

Reading the variable "%1" failed with error code 0x%2!8.8X!.

DTS_E_EXPREVALVARIABLENOTFOUND DTS_E_EXPREVALVARIABLENOTFOUND DTS_E_EXPREVALVARIABLENOTFOUND

The variable "%1" was not found in the Variables collection. The variable might not exist in the correct scope.

DTS_E_EXPREVALVARIABLETYPENOTSUPPORTED DTS_E_EXPREVALVARIABLETYPENOTSUPPORTED DTS_E_EXPREVALVARIABLETYPENOTSUPPORTED

The data type of variable "%1" is not supported in an expression.

DTS_E_EXPRSENSITIVEPARAMVALUENOTALLOWED DTS_E_EXPRSENSITIVEPARAMVALUENOTALLOWED DTS_E_EXPRSENSITIVEPARAMVALUENOTALLOWED

The sensitive parameter value is not allowed.

DTS_E_EXTENDFAILED DTS_E_EXTENDFAILED DTS_E_EXTENDFAILED

The buffer manager cannot extend the file "%1" to length %2!lu!. There was insufficient disk space.

DTS_E_EXTERNALCOLUMNMETADATACODEPAGEMISMATCH DTS_E_EXTERNALCOLUMNMETADATACODEPAGEMISMATCH DTS_E_EXTERNALCOLUMNMETADATACODEPAGEMISMATCH

The code page on %1 is %2!d! and is required to be %3!d!.

DTS_E_EXTERNALMETADATACOLUMNISALREADYMAPPED DTS_E_EXTERNALMETADATACOLUMNISALREADYMAPPED DTS_E_EXTERNALMETADATACOLUMNISALREADYMAPPED

The external metadata column with ID %1!d! has already been mapped to %2.

DTS_E_EXTRACTORCANTAPPENDTRUNCATE DTS_E_EXTRACTORCANTAPPENDTRUNCATE DTS_E_EXTRACTORCANTAPPENDTRUNCATE

There is an error caused by conflicting property settings. The "%1" has both the AllowAppend property and the ForceTruncate property set to TRUE. Both properties cannot be set to TRUE. Set one of the two properties to FALSE.

DTS_E_EXTRACTORCANTWRITE DTS_E_EXTRACTORCANTWRITE DTS_E_EXTRACTORCANTWRITE

Writing to the file "%1" failed with error code 0x%2!8.8X!.

DTS_E_EXTRACTORCOLUMNALREADYREFERENCED DTS_E_EXTRACTORCOLUMNALREADYREFERENCED DTS_E_EXTRACTORCOLUMNALREADYREFERENCED

The %1 references column ID %2!d!, but that column is already referenced by %3. Remove one of the two reference to the column.

DTS_E_EXTRACTORDATACOLUMNNOTBLOB DTS_E_EXTRACTORDATACOLUMNNOTBLOB DTS_E_EXTRACTORDATACOLUMNNOTBLOB

The "%1" references "%2", and that column is not of a BLOB type.

DTS_E_EXTRACTORFILENAMECOLUMNNOTSTRING DTS_E_EXTRACTORFILENAMECOLUMNNOTSTRING DTS_E_EXTRACTORFILENAMECOLUMNNOTSTRING

The "%1" should contain a file name, but it is not of a String type.

DTS_E_EXTRACTORINVALIDCOLUMNDATATYPE DTS_E_EXTRACTORINVALIDCOLUMNDATATYPE DTS_E_EXTRACTORINVALIDCOLUMNDATATYPE

The %1 has an unsupported data type. It must be DT_STR, DT_WSTR, DT_TEXT, DT_NTEXT, or DT_IMAGE.

DTS_E_EXTRACTORREFERENCEDCOLUMNNOTFOUND DTS_E_EXTRACTORREFERENCEDCOLUMNNOTFOUND DTS_E_EXTRACTORREFERENCEDCOLUMNNOTFOUND

The "%1" references column ID %2!d!, and that column is not found on the input. A reference points to a non-existent column.

DTS_E_EXTRACTORUNREFERENCED DTS_E_EXTRACTORUNREFERENCED DTS_E_EXTRACTORUNREFERENCED

The "%1" is marked read-only, but is not referenced by any other column. Unreferenced columns are not allowed.

DTS_E_FAILED_EXECUTE_IS_SERVER_PACKAGE DTS_E_FAILED_EXECUTE_IS_SERVER_PACKAGE DTS_E_FAILED_EXECUTE_IS_SERVER_PACKAGE

The failed execution is a server package.

DTS_E_FAILEDCOLUMNDATACONVERSIONSTATUS DTS_E_FAILEDCOLUMNDATACONVERSIONSTATUS DTS_E_FAILEDCOLUMNDATACONVERSIONSTATUS

The data conversion failed. The data conversion for column "%1" returned status value %2!d! and status text "%3".

DTS_E_FAILEDCREATEXMLDOCUMENT DTS_E_FAILEDCREATEXMLDOCUMENT DTS_E_FAILEDCREATEXMLDOCUMENT

An XML document "%1" failed to create.

DTS_E_FAILEDDEPENDENCIES DTS_E_FAILEDDEPENDENCIES DTS_E_FAILEDDEPENDENCIES

There was an error enumerating the package dependencies. Check other messages for more information.

DTS_E_FAILEDDURINGOLEDBDATATYPECONVERSIONCHECK DTS_E_FAILEDDURINGOLEDBDATATYPECONVERSIONCHECK DTS_E_FAILEDDURINGOLEDBDATATYPECONVERSIONCHECK

The OLE DB provider failed during the data type conversion verification for "%1".

DTS_E_FAILEDGETTYPEINFO DTS_E_FAILEDGETTYPEINFO DTS_E_FAILEDGETTYPEINFO

The object does not support type information. This occurs when the runtime attempts to get the type information from an object to populate the Properties collection. The object must support type information.

DTS_E_FAILEDPOPNATIVEFEE DTS_E_FAILEDPOPNATIVEFEE DTS_E_FAILEDPOPNATIVEFEE

The ForEachEnumeratorInfos collection with native ForEachEnumeratorsfailed to populate with the following error code: %1.

DTS_E_FAILEDPROPERTYGET DTS_E_FAILEDPROPERTYGET DTS_E_FAILEDPROPERTYGET

An error occurred while retrieving the value of property "%1". The error code is 0x%2!8.8X!.

DTS_E_FAILEDPROPERTYGET_ERRORINFO DTS_E_FAILEDPROPERTYGET_ERRORINFO DTS_E_FAILEDPROPERTYGET_ERRORINFO

An error occurred while retrieving the value of property "%1". The error code is 0x%2!8.8X! "%3".

DTS_E_FAILEDPROPERTYSET DTS_E_FAILEDPROPERTYSET DTS_E_FAILEDPROPERTYSET

An error occurred while setting the value of property "%1". The error returned is 0x%2!8.8X!.

DTS_E_FAILEDPROPERTYSET_ERRORINFO DTS_E_FAILEDPROPERTYSET_ERRORINFO DTS_E_FAILEDPROPERTYSET_ERRORINFO

An error occurred while setting the value of property "%1". The error returned is 0x%2!8.8X! "%3".

DTS_E_FAILEDSETEXECVALVARIABLE DTS_E_FAILEDSETEXECVALVARIABLE DTS_E_FAILEDSETEXECVALVARIABLE

The wrapper was unable to set the value of the variable specified in the ExecutionValueVariable property.

DTS_E_FAILEDSYSTEMVARIABLEREMOVE DTS_E_FAILEDSYSTEMVARIABLEREMOVE DTS_E_FAILEDSYSTEMVARIABLEREMOVE

An attempt to remove a system variable failed. This error occurs when removing a variable that is a required variable. Required variables are variables that are created by the runtime for communicating between tasks and the runtime.

DTS_E_FAILEDTOACCESSLOBCOLUMN DTS_E_FAILEDTOACCESSLOBCOLUMN DTS_E_FAILEDTOACCESSLOBCOLUMN

An attempt to access LOB data from the data flow buffer for data source column "%1" failed with error code 0x%2!8.8X!.

DTS_E_FAILEDTOALLOCATEROWHANDLEBUFFER DTS_E_FAILEDTOALLOCATEROWHANDLEBUFFER DTS_E_FAILEDTOALLOCATEROWHANDLEBUFFER

The attempt to allocate a row handle buffer failed with error code 0x%1!8.8X!.

DTS_E_FAILEDTOBUFFERROWSTARTS DTS_E_FAILEDTOBUFFERROWSTARTS DTS_E_FAILEDTOBUFFERROWSTARTS

The attempt to retrieve the start of the buffer row failed with error code 0x%1!8.8X!.

DTS_E_FAILEDTOCREATEEXPRESSIONARRAY DTS_E_FAILEDTOCREATEEXPRESSIONARRAY DTS_E_FAILEDTOCREATEEXPRESSIONARRAY

The memory cannot be allocated for the Expression objects. An out-of-memory error occurred while creating the array of Expression object pointers.

DTS_E_FAILEDTOCREATEEXPRESSIONMANANGER DTS_E_FAILEDTOCREATEEXPRESSIONMANANGER DTS_E_FAILEDTOCREATEEXPRESSIONMANANGER

The %1 failed with error code 0x%2!8.8X! while creating the Expression Manager.

DTS_E_FAILEDTODIRECTERRORROW DTS_E_FAILEDTODIRECTERRORROW DTS_E_FAILEDTODIRECTERRORROW

An attempt directing the row to the error output failed with error code 0x%1!8.8X!.

DTS_E_FAILEDTOFINDCOLUMNBYLINEAGEID DTS_E_FAILEDTOFINDCOLUMNBYLINEAGEID DTS_E_FAILEDTOFINDCOLUMNBYLINEAGEID

An attempt to find %1 with lineage ID %2!d! in the Data Flow Task buffer failed with error code 0x%3!8.8X!.

DTS_E_FAILEDTOFINDCOLUMNINBUFFER DTS_E_FAILEDTOFINDCOLUMNINBUFFER DTS_E_FAILEDTOFINDCOLUMNINBUFFER

An attempt to find column "%1" with lineage ID %2!d! in the buffer failed. The buffer manager returned error code 0x%3!8.8X!.

DTS_E_FAILEDTOFINDERRORCOLUMN DTS_E_FAILEDTOFINDERRORCOLUMN DTS_E_FAILEDTOFINDERRORCOLUMN

An error occurred, but the column that caused the error cannot be determined.

DTS_E_FAILEDTOFINDNONSPECIALERRORCOLUMN DTS_E_FAILEDTOFINDNONSPECIALERRORCOLUMN DTS_E_FAILEDTOFINDNONSPECIALERRORCOLUMN

An attempt to find any non-special error column in %1 failed.

DTS_E_FAILEDTOGETBUFFERBOUNDARYINFO DTS_E_FAILEDTOGETBUFFERBOUNDARYINFO DTS_E_FAILEDTOGETBUFFERBOUNDARYINFO

The attempt to get buffer boundary information failed with error code 0x%1!8.8X!.

DTS_E_FAILEDTOGETCOLINFO DTS_E_FAILEDTOGETCOLINFO DTS_E_FAILEDTOGETCOLINFO

An attempt to get information for row %1!ld!, column %2!ld! from the buffer failed. The error code returned was 0x%3!8.8X!.

DTS_E_FAILEDTOGETCOLUMNINFOFROMBUFFER DTS_E_FAILEDTOGETCOLUMNINFOFROMBUFFER DTS_E_FAILEDTOGETCOLUMNINFOFROMBUFFER

An attempt to get information for column "%1" (%2!d!) from the buffer failed. The error code returned was 0x%3!8.8X!.

DTS_E_FAILEDTOGETCOMPONENTLOCALEID DTS_E_FAILEDTOGETCOMPONENTLOCALEID DTS_E_FAILEDTOGETCOMPONENTLOCALEID

There is a failure retrieving component locale ID. Error code 0x%1!8.8X!.

DTS_E_FAILEDTOGETCONNECTIONSTRING DTS_E_FAILEDTOGETCONNECTIONSTRING DTS_E_FAILEDTOGETCONNECTIONSTRING

An attempt to get the connection string failed.

DTS_E_FAILEDTOGETDATAFORERROROUTPUTBUFFER DTS_E_FAILEDTOGETDATAFORERROROUTPUTBUFFER DTS_E_FAILEDTOGETDATAFORERROROUTPUTBUFFER

An attempt to get data for the error output buffer failed.

DTS_E_FAILEDTOGETFILESIZE DTS_E_FAILEDTOGETFILESIZE DTS_E_FAILEDTOGETFILESIZE

An error occurred while getting the file size for file "%1".

DTS_E_FAILEDTOGETLOCALEIDFROMPACKAGE DTS_E_FAILEDTOGETLOCALEIDFROMPACKAGE DTS_E_FAILEDTOGETLOCALEIDFROMPACKAGE

The %1 failed to get the locale ID from the package.

DTS_E_FAILEDTOINITIALIZEFLATFILEPARSER DTS_E_FAILEDTOINITIALIZEFLATFILEPARSER DTS_E_FAILEDTOINITIALIZEFLATFILEPARSER

An error occurred while initializing the flat file parser.

DTS_E_FAILEDTOLOADCACHE DTS_E_FAILEDTOLOADCACHE DTS_E_FAILEDTOLOADCACHE

An attempt to load the cache from file, "__" failed.

DTS_E_FAILEDTOPREPAREBUFFERSTATUS DTS_E_FAILEDTOPREPAREBUFFERSTATUS DTS_E_FAILEDTOPREPAREBUFFERSTATUS

The attempt to prepare the buffer status failed with error code 0x%1!8.8X!.

DTS_E_FAILEDTOPREPARECOLUMNSTATUSESFORINSERT DTS_E_FAILEDTOPREPARECOLUMNSTATUSESFORINSERT DTS_E_FAILEDTOPREPARECOLUMNSTATUSESFORINSERT

An attempt preparing column statuses for insert failed with error code 0x%1!8.8X!.

DTS_E_FAILEDTOREMOVEROWFROMBUFFER DTS_E_FAILEDTOREMOVEROWFROMBUFFER DTS_E_FAILEDTOREMOVEROWFROMBUFFER

An attempt removing a row from the buffer failed with error code 0x%1!8.8X!.

DTS_E_FAILEDTOSENDROWTOSQLSERVER DTS_E_FAILEDTOSENDROWTOSQLSERVER DTS_E_FAILEDTOSENDROWTOSQLSERVER

The attempt to send a row to SQL Server failed with error code 0x%1!8.8X!.

DTS_E_FAILEDTOSETBUFFERENDOFROWSET DTS_E_FAILEDTOSETBUFFERENDOFROWSET DTS_E_FAILEDTOSETBUFFERENDOFROWSET

An attempt setting the end of row set for the buffer failed with error code 0x%1!8.8X!.

DTS_E_FAILEDTOSETBUFFERERRORINFO DTS_E_FAILEDTOSETBUFFERERRORINFO DTS_E_FAILEDTOSETBUFFERERRORINFO

The attempt to set buffer error information failed with error code 0x%1!8.8X!.

DTS_E_FAILEDTOSETCOLINFO DTS_E_FAILEDTOSETCOLINFO DTS_E_FAILEDTOSETCOLINFO

An attempt to set information for row %1!ld!, column %2!ld! into the buffer failed. The error code returned was 0x%3!8.8X!.

DTS_E_FAILEDTOSETFILEPOINTER DTS_E_FAILEDTOSETFILEPOINTER DTS_E_FAILEDTOSETFILEPOINTER

An error occurred while setting the file pointer for file "%1".

DTS_E_FAILEDTOSETOUTPUTCOLUMNDATATYPEPROPERTIES DTS_E_FAILEDTOSETOUTPUTCOLUMNDATATYPEPROPERTIES DTS_E_FAILEDTOSETOUTPUTCOLUMNDATATYPEPROPERTIES

An attempt to set the data type properties on "%1" failed with error code 0x%2!8.8X!. The error occurred while attempting to set one or more of the data type properties of the output column.

DTS_E_FAILEDTOSETOUTPUTCOLUMNTYPE DTS_E_FAILEDTOSETOUTPUTCOLUMNTYPE DTS_E_FAILEDTOSETOUTPUTCOLUMNTYPE

An attempt to set the type of %1 to type: "%2", length: %3!d!, precision: %4!d!, scale: %5!d!, code page: %6!d! failed.

DTS_E_FAILEDTOSETPROPERTY DTS_E_FAILEDTOSETPROPERTY DTS_E_FAILEDTOSETPROPERTY

An attempt to set property "%1" on "%2" failed.

DTS_E_FAILEDTOSETUSAGETYPE DTS_E_FAILEDTOSETUSAGETYPE DTS_E_FAILEDTOSETUSAGETYPE

The "%1" was unable to make the requested change to the input column with lineage ID %2!d!. The request failed with error code 0x%3!8.8X!. The specified error occurred while attempting to set the usage type of an input column.

DTS_E_FAILEDTOWRITEOUTCOLUMNNAME DTS_E_FAILEDTOWRITEOUTCOLUMNNAME DTS_E_FAILEDTOWRITEOUTCOLUMNNAME

An attempt to write out column name for column "%1" failed.

DTS_E_FAILEDTOWRITEOUTHEADER DTS_E_FAILEDTOWRITEOUTHEADER DTS_E_FAILEDTOWRITEOUTHEADER

An error occurred while writing out the file header.

DTS_E_FAILEDTOWRITETOTHEFILENAMECOLUMN DTS_E_FAILEDTOWRITETOTHEFILENAMECOLUMN DTS_E_FAILEDTOWRITETOTHEFILENAMECOLUMN

The attempt to write to the filename column failed with error code 0x%1!8.8X!.

DTS_E_FAILLOADINGPROPERTY DTS_E_FAILLOADINGPROPERTY DTS_E_FAILLOADINGPROPERTY

An attempt to load the value property "%1" failed using default persistence.

DTS_E_FAILPACKAGEONFAILURENA DTS_E_FAILPACKAGEONFAILURENA DTS_E_FAILPACKAGEONFAILURENA

The FailPackageOnFailure property is not applicable to the package container.

DTS_E_FAILTOCREATEMUTEX DTS_E_FAILTOCREATEMUTEX DTS_E_FAILTOCREATEMUTEX

An attempt to create mutex "" failed with error .

DTS_E_FAILTORELEASEMUTEX DTS_E_FAILTORELEASEMUTEX DTS_E_FAILTORELEASEMUTEX

An attempt to release mutex "" failed with error .

DTS_E_FASTPARSENOTALLOWED DTS_E_FASTPARSENOTALLOWED DTS_E_FASTPARSENOTALLOWED

The "%1" custom property for "%2" cannot be set to true. The column data type must be one of the following: DT_I1, DT_I2, DT_I4, DT_I8, DT_UI1, DT_UI2, DT_UI4, DT_UI8, DT_DBTIMESTAMP, DT_DATE, DT_DBDATE, DT_DBTIME, or DT_FILETIME.

DTS_E_FG_COPY_INPUT DTS_E_FG_COPY_INPUT DTS_E_FG_COPY_INPUT

The Fuzzy Grouping transformation failed to copy input.

DTS_E_FG_FUZZY_MATCH_ON_NONSTRING DTS_E_FG_FUZZY_MATCH_ON_NONSTRING DTS_E_FG_FUZZY_MATCH_ON_NONSTRING

A fuzzy match is specified on column "%1" (%2!d!) that is not a data type of DT_STR or DT_WSTR.

DTS_E_FG_GENERATE_GROUPS DTS_E_FG_GENERATE_GROUPS DTS_E_FG_GENERATE_GROUPS

The Fuzzy Grouping transformation failed to generate groups.

DTS_E_FG_LEADING_TRAILING DTS_E_FG_LEADING_TRAILING DTS_E_FG_LEADING_TRAILING

An unexpected error occurred in Fuzzy Grouping when applying the settings of property '%1'.

DTS_E_FG_MISSING_OUTPUT_COLUMNS DTS_E_FG_MISSING_OUTPUT_COLUMNS DTS_E_FG_MISSING_OUTPUT_COLUMNS

The special transformation-specific columns are either missing or have incorrect types.

DTS_E_FG_NOBLOBS DTS_E_FG_NOBLOBS DTS_E_FG_NOBLOBS

The Fuzzy Grouping does not support input columns of type IMAGE, TEXT, or NTEXT.

DTS_E_FG_PICK_CANONICAL DTS_E_FG_PICK_CANONICAL DTS_E_FG_PICK_CANONICAL

The Fuzzy Grouping transformation failed to pick a canonical row of data to use in standardizing the data.

DTS_E_FG_PREPARE_TABLES_AND_ACCESSORS DTS_E_FG_PREPARE_TABLES_AND_ACCESSORS DTS_E_FG_PREPARE_TABLES_AND_ACCESSORS

The Fuzzy Grouping transformation failed to create required tables and accessors.

DTS_E_FILENAMEINVALID DTS_E_FILENAMEINVALID DTS_E_FILENAMEINVALID

The file name is not valid. The file name is a device or contains invalid characters.

DTS_E_FILENAMEINVALIDWITHPARAM DTS_E_FILENAMEINVALIDWITHPARAM DTS_E_FILENAMEINVALIDWITHPARAM

The file name "%1" is not valid. The file name is a device or contains invalid characters.

DTS_E_FILENAMEOUTPUTCOLUMNINVALIDDATATYPE DTS_E_FILENAMEOUTPUTCOLUMNINVALIDDATATYPE DTS_E_FILENAMEOUTPUTCOLUMNINVALIDDATATYPE

The output column for the file name is not a null-terminated Unicode character string, which is data type DT_WSTR.

DTS_E_FILENAMEOUTPUTCOLUMNOTFOUND DTS_E_FILENAMEOUTPUTCOLUMNOTFOUND DTS_E_FILENAMEOUTPUTCOLUMNOTFOUND

The output column for the file name cannot be found.

DTS_E_FILEOPENERR_FORREAD DTS_E_FILEOPENERR_FORREAD DTS_E_FILEOPENERR_FORREAD

An attempt opening the file "%1" for reading failed with error code 0x%2!8.8X!.

DTS_E_FILEOPENERR_FORREAD_ACCESSDENIED DTS_E_FILEOPENERR_FORREAD_ACCESSDENIED DTS_E_FILEOPENERR_FORREAD_ACCESSDENIED

Attempting to open the file "%1" for reading failed. Access is denied.

DTS_E_FILEOPENERR_FORREAD_FILENOTFOUND DTS_E_FILEOPENERR_FORREAD_FILENOTFOUND DTS_E_FILEOPENERR_FORREAD_FILENOTFOUND

An attempt opening the file "%1" for reading failed. The file was not found.

DTS_E_FILEOPENERR_FORREAD_PATHNOTFOUND DTS_E_FILEOPENERR_FORREAD_PATHNOTFOUND DTS_E_FILEOPENERR_FORREAD_PATHNOTFOUND

An attempt opening the file "%1" for reading failed. The path cannot be found.

DTS_E_FILEOPENERR_FORREAD_TOOMANYOPENFILES DTS_E_FILEOPENERR_FORREAD_TOOMANYOPENFILES DTS_E_FILEOPENERR_FORREAD_TOOMANYOPENFILES

An attempt opening the file "%1" for reading failed. There are too many files open.

DTS_E_FILEOPENERR_FORWRITE DTS_E_FILEOPENERR_FORWRITE DTS_E_FILEOPENERR_FORWRITE

An attempt opening the file "%1" for writing failed with error code 0x%2!8.8X!.

DTS_E_FILEOPENERR_FORWRITE_ACCESSDENIED DTS_E_FILEOPENERR_FORWRITE_ACCESSDENIED DTS_E_FILEOPENERR_FORWRITE_ACCESSDENIED

An attempt opening the file "%1" for writing failed. You do not have the correct permissions.

DTS_E_FILEOPENERR_FORWRITE_FILEEXISTS DTS_E_FILEOPENERR_FORWRITE_FILEEXISTS DTS_E_FILEOPENERR_FORWRITE_FILEEXISTS

An attempt opening the file "%1" for writing failed. The file exists and cannot be overwritten. If the AllowAppend property is FALSE and the ForceTruncate property is set to FALSE, the existence of the file will cause this failure.

DTS_E_FILEOPENERR_FORWRITE_FILENOTFOUND DTS_E_FILEOPENERR_FORWRITE_FILENOTFOUND DTS_E_FILEOPENERR_FORWRITE_FILENOTFOUND

An attempt opening the file "%1" for writing failed. The file cannot be found.

DTS_E_FILEOPENERR_FORWRITE_PATHNOTFOUND DTS_E_FILEOPENERR_FORWRITE_PATHNOTFOUND DTS_E_FILEOPENERR_FORWRITE_PATHNOTFOUND

An attempt opening the file "%1" for writing failed. The path cannot be found.

DTS_E_FILEOPENERR_FORWRITE_TOOMANYOPENFILES DTS_E_FILEOPENERR_FORWRITE_TOOMANYOPENFILES DTS_E_FILEOPENERR_FORWRITE_TOOMANYOPENFILES

An attempt opening the file "%1" for writing failed. There are too many files open.

DTS_E_FILEREADFAILED DTS_E_FILEREADFAILED DTS_E_FILEREADFAILED

The buffer manager cannot read %1!d! bytes from file "%2". The file is damaged.

DTS_E_FILEWRITEERR_DISKFULL DTS_E_FILEWRITEERR_DISKFULL DTS_E_FILEWRITEERR_DISKFULL

An attempt opening the file "%1" for writing failed because the disk is full. There is not sufficient disk space to save this file.

DTS_E_FILEWRITEFAILED DTS_E_FILEWRITEFAILED DTS_E_FILEWRITEFAILED

The buffer manager cannot write %1!d! bytes to file "%2". There was insufficient disk space or quota.

DTS_E_FINDFOLDERONSQLSERVER_OLEDB DTS_E_FINDFOLDERONSQLSERVER_OLEDB DTS_E_FINDFOLDERONSQLSERVER_OLEDB

While trying to find a folder on SQL, an OLE DB error was encountered with error code 0x%1!8.8X! (%2).

DTS_E_FLATFILEFORMATNOTSUPPORTED DTS_E_FLATFILEFORMATNOTSUPPORTED DTS_E_FLATFILEFORMATNOTSUPPORTED

The format "%1" is not supported by Flat File Connection Manager. Supported formats are Delimited, FixedWidth, RaggedRight, and Mixed.

DTS_E_FLATFILESOURCEADAPTERSTATIC_CANTCONVERTVALUE DTS_E_FLATFILESOURCEADAPTERSTATIC_CANTCONVERTVALUE DTS_E_FLATFILESOURCEADAPTERSTATIC_CANTCONVERTVALUE

The data value cannot be converted for reasons other than sign mismatch or data overflow.

DTS_E_FLATFILESOURCEADAPTERSTATIC_DATAOVERFLOW DTS_E_FLATFILESOURCEADAPTERSTATIC_DATAOVERFLOW DTS_E_FLATFILESOURCEADAPTERSTATIC_DATAOVERFLOW

The conversion failed because the data value overflowed the type used by the flat file source adapter.

DTS_E_FLATFILESOURCEADAPTERSTATIC_SIGNMISMATCH DTS_E_FLATFILESOURCEADAPTERSTATIC_SIGNMISMATCH DTS_E_FLATFILESOURCEADAPTERSTATIC_SIGNMISMATCH

The conversion failed because the data value was signed and the type used by the flat file source adapter was unsigned.

DTS_E_FLATFILESOURCEADAPTERSTATIC_TRUNCATED DTS_E_FLATFILESOURCEADAPTERSTATIC_TRUNCATED DTS_E_FLATFILESOURCEADAPTERSTATIC_TRUNCATED

The data was truncated.

DTS_E_FLATFILESOURCEADAPTERSTATIC_UNAVAILABLE DTS_E_FLATFILESOURCEADAPTERSTATIC_UNAVAILABLE DTS_E_FLATFILESOURCEADAPTERSTATIC_UNAVAILABLE

The status is not available.

DTS_E_FOLDERADDFAILED DTS_E_FOLDERADDFAILED DTS_E_FOLDERADDFAILED

An error was encountered when trying to create a folder on SQL Server named "%1" in folder "%2".

DTS_E_FOLDERDELETEFAILED DTS_E_FOLDERDELETEFAILED DTS_E_FOLDERDELETEFAILED

There is an error deleting SQL Server folder "%1".

DTS_E_FOLDERNOTFOUND DTS_E_FOLDERNOTFOUND DTS_E_FOLDERNOTFOUND

The folder "%1" cannot be found.

DTS_E_FOLDERRENAMEFAILED DTS_E_FOLDERRENAMEFAILED DTS_E_FOLDERRENAMEFAILED

An error occurred when renaming folder " %1\\%2" to "%1\\%3" on SQL Server.

DTS_E_FORBIDDEN DTS_E_FORBIDDEN DTS_E_FORBIDDEN

The server returned error code "403 - Forbidden". This error can occur when the specified resource needs "https" access, but the certificate validity period has expired, the certificate is not valid for the use requested, or the certificate has been revoked or revocation cannot be checked.

DTS_E_FOREACHVARIABLEMAPPING DTS_E_FOREACHVARIABLEMAPPING DTS_E_FOREACHVARIABLEMAPPING

The ForEach Variable Mapping number %1!d! to variable "%2" cannot be applied.

DTS_E_FORLOOPASSIGNEXPRESSIONINVALID DTS_E_FORLOOPASSIGNEXPRESSIONINVALID DTS_E_FORLOOPASSIGNEXPRESSIONINVALID

The assignment expression for the loop is not valid and needs to be modified. There should be additional error messages.

DTS_E_FORLOOPEVALEXPRESSIONINVALID DTS_E_FORLOOPEVALEXPRESSIONINVALID DTS_E_FORLOOPEVALEXPRESSIONINVALID

The evaluation expression for the loop is not valid. The expression needs to be modified. There should be additional error messages.

DTS_E_FORLOOPHASNOEXPRESSION DTS_E_FORLOOPHASNOEXPRESSION DTS_E_FORLOOPHASNOEXPRESSION

There is no expression for the loop to evaluate. This error occurs when the expression on the For Loop is empty. Add an expression.

DTS_E_FORLOOPINITEXPRESSIONINVALID DTS_E_FORLOOPINITEXPRESSIONINVALID DTS_E_FORLOOPINITEXPRESSIONINVALID

The initialization expression for the loop is not valid and needs to be modified. There should be additional error messages.

DTS_E_FOUNDORPHANEDEXTERNALMETADATACOLUMN DTS_E_FOUNDORPHANEDEXTERNALMETADATACOLUMN DTS_E_FOUNDORPHANEDEXTERNALMETADATACOLUMN

The %1 does not have a corresponding input or output column.

DTS_E_FROMEXECISNOTCHILD DTS_E_FROMEXECISNOTCHILD DTS_E_FROMEXECISNOTCHILD

When adding a precedence constraint, a From executable was specified that is not a child of this container.

DTS_E_FSTASK_CANTCREATEDIR DTS_E_FSTASK_CANTCREATEDIR DTS_E_FSTASK_CANTCREATEDIR

The directory cannot be created. User chose to fail the task if directory exists.

DTS_E_FSTASK_CONNECTIONTYPENOTFILE DTS_E_FSTASK_CONNECTIONTYPENOTFILE DTS_E_FSTASK_CONNECTIONTYPENOTFILE

The type of Connection "%1" is not a file.

DTS_E_FSTASK_DESTCONNUSAGETYPEINVALID DTS_E_FSTASK_DESTCONNUSAGETYPEINVALID DTS_E_FSTASK_DESTCONNUSAGETYPEINVALID

The destination file connection manager "%1" has an invalid usage type: "%2".

DTS_E_FSTASK_DESTINATIONISEMPTY DTS_E_FSTASK_DESTINATIONISEMPTY DTS_E_FSTASK_DESTINATIONISEMPTY

The destination is empty.

DTS_E_FSTASK_DESTINATIONNOTSET DTS_E_FSTASK_DESTINATIONNOTSET DTS_E_FSTASK_DESTINATIONNOTSET

The Destination property of operation "%1" not set.

DTS_E_FSTASK_DIRECTORYDELETED DTS_E_FSTASK_DIRECTORYDELETED DTS_E_FSTASK_DIRECTORYDELETED

The Directory "%1" was deleted.

DTS_E_FSTASK_DIRECTORYEXISTS DTS_E_FSTASK_DIRECTORYEXISTS DTS_E_FSTASK_DIRECTORYEXISTS

The Directory already exists.

DTS_E_FSTASK_FILEDELETED DTS_E_FSTASK_FILEDELETED DTS_E_FSTASK_FILEDELETED

The file or directory "%1" was deleted.

DTS_E_FSTASK_FILEDIRNOTFOUND DTS_E_FSTASK_FILEDIRNOTFOUND DTS_E_FSTASK_FILEDIRNOTFOUND

The file or directory "%1" does not exist.

DTS_E_FSTASK_FILEDOESNOTEXIST DTS_E_FSTASK_FILEDOESNOTEXIST DTS_E_FSTASK_FILEDOESNOTEXIST

The file or directory "%1" represented by connection "%2" does not exist.

DTS_E_FSTASK_INVALIDDATA DTS_E_FSTASK_INVALIDDATA DTS_E_FSTASK_INVALIDDATA

The File System task received an invalid task data node.

DTS_E_FSTASK_INVALIDDESTPATH DTS_E_FSTASK_INVALIDDESTPATH DTS_E_FSTASK_INVALIDDESTPATH

The destination path is invalid.

DTS_E_FSTASK_LOGENTRYGETTINGFILEOPERATION DTS_E_FSTASK_LOGENTRYGETTINGFILEOPERATION DTS_E_FSTASK_LOGENTRYGETTINGFILEOPERATION

The FileSystemOperation.

DTS_E_FSTASK_LOGENTRYGETTINGFILEOPERATIONDESC DTS_E_FSTASK_LOGENTRYGETTINGFILEOPERATIONDESC DTS_E_FSTASK_LOGENTRYGETTINGFILEOPERATIONDESC

Provides information regarding File System operations.

DTS_E_FSTASK_NOATTRIBUTESET DTS_E_FSTASK_NOATTRIBUTESET DTS_E_FSTASK_NOATTRIBUTESET

An attribute is not set.

DTS_E_FSTASK_PATHNOTVALID DTS_E_FSTASK_PATHNOTVALID DTS_E_FSTASK_PATHNOTVALID

The "%1" is not valid on operation type "%2".

DTS_E_FSTASK_SOURCEISEMPTY DTS_E_FSTASK_SOURCEISEMPTY DTS_E_FSTASK_SOURCEISEMPTY

The source is empty.

DTS_E_FSTASK_SOURCENOTSET DTS_E_FSTASK_SOURCENOTSET DTS_E_FSTASK_SOURCENOTSET

The source property of operation "%1" not set.

DTS_E_FSTASK_SRCCONNUSAGETYPEINVALID DTS_E_FSTASK_SRCCONNUSAGETYPEINVALID DTS_E_FSTASK_SRCCONNUSAGETYPEINVALID

The source file connection manager "%1" has an invalid usage type "%2".

DTS_E_FSTASK_SYNCFAILED DTS_E_FSTASK_SYNCFAILED DTS_E_FSTASK_SYNCFAILED

The synchronization object failed.

DTS_E_FSTASK_TASKDESCRIPTION DTS_E_FSTASK_TASKDESCRIPTION DTS_E_FSTASK_TASKDESCRIPTION

Performs file system operations, such as copying and deleting files.

DTS_E_FSTASK_TASKDISPLAYNAME DTS_E_FSTASK_TASKDISPLAYNAME DTS_E_FSTASK_TASKDISPLAYNAME

The File System Task.

DTS_E_FSTASK_VARIABLEDOESNTEXIST DTS_E_FSTASK_VARIABLEDOESNTEXIST DTS_E_FSTASK_VARIABLEDOESNTEXIST

The variable "%1" does not exist.

DTS_E_FSTASK_VARIABLENOTASTRING DTS_E_FSTASK_VARIABLENOTASTRING DTS_E_FSTASK_VARIABLENOTASTRING

The variable "%1" is not a string.

DTS_E_FSTASK_VARSRCORDESTISEMPTY DTS_E_FSTASK_VARSRCORDESTISEMPTY DTS_E_FSTASK_VARSRCORDESTISEMPTY

The variable "%1" is used as a source or destination and is empty.

DTS_E_FTPCHANGEFOLDER DTS_E_FTPCHANGEFOLDER DTS_E_FTPCHANGEFOLDER

Changing current directory to "%1". %2.

DTS_E_FTPCREATEFOLDER DTS_E_FTPCREATEFOLDER DTS_E_FTPCREATEFOLDER

Creating folder "%1" ... %2.

DTS_E_FTPDELETEFOLDER DTS_E_FTPDELETEFOLDER DTS_E_FTPDELETEFOLDER

Deleting folder "%1" ... %2.

DTS_E_FTPERROR DTS_E_FTPERROR DTS_E_FTPERROR

An error occurred in the requested FTP operation. Detailed error description: %1.

DTS_E_FTPFILESEMPTY DTS_E_FTPFILESEMPTY DTS_E_FTPFILESEMPTY

There are no files to transfer. This error can occur when performing a Send or Receive operation and no files are specified for the transfer.

DTS_E_FTPINVALIDCONNECTIONSTRING DTS_E_FTPINVALIDCONNECTIONSTRING DTS_E_FTPINVALIDCONNECTIONSTRING

The port specified in the connection string is not valid. The ConnectionString format is ServerName:Port. Port should be an integer value between %1!d! and %2!d!.

DTS_E_FTPINVALIDLOCALPATH DTS_E_FTPINVALIDLOCALPATH DTS_E_FTPINVALIDLOCALPATH

The specified local path is not valid. Specify a valid local path. This can occur when the specified local path is null.

DTS_E_FTPINVALIDPORT DTS_E_FTPINVALIDPORT DTS_E_FTPINVALIDPORT

The FTP Port contains an invalid value. The FTP Port value should be an integer between %1!d! and %2!d!.

DTS_E_FTPINVALIDRETRIES DTS_E_FTPINVALIDRETRIES DTS_E_FTPINVALIDRETRIES

The number of retries is not valid. The number of retries should be between %1!d! and %2!d!.

DTS_E_FTPNOFILESTODELETE DTS_E_FTPNOFILESTODELETE DTS_E_FTPNOFILESTODELETE

There are no files specified to delete.

DTS_E_FTPNOTCONNECTED DTS_E_FTPNOTCONNECTED DTS_E_FTPNOTCONNECTED

The connection with the FTP server has not been established.

DTS_E_FTPTASK__INITIALIZATION_WITH_NULL_XML_ELEMENT DTS_E_FTPTASK__INITIALIZATION_WITH_NULL_XML_ELEMENT DTS_E_FTPTASK__INITIALIZATION_WITH_NULL_XML_ELEMENT

The task cannot be initialized with a null XML element.

DTS_E_FTPTASK_CANNOTACQUIRECONNECTION DTS_E_FTPTASK_CANNOTACQUIRECONNECTION DTS_E_FTPTASK_CANNOTACQUIRECONNECTION

There was an error acquiring the FTP connection. Verify that a valid connection type is specified in "%1".

DTS_E_FTPTASK_CONNECTION_NAME_NULL DTS_E_FTPTASK_CONNECTION_NAME_NULL DTS_E_FTPTASK_CONNECTION_NAME_NULL

The connection is empty. Verify that a valid FTP connection is provided.

DTS_E_FTPTASK_CONNECTION_NOT_FTP DTS_E_FTPTASK_CONNECTION_NOT_FTP DTS_E_FTPTASK_CONNECTION_NOT_FTP

The connection specified is not an FTP connection. Verify that a valid FTP connection is provided.

DTS_E_FTPTASK_CONNECTIONNOTFOUND DTS_E_FTPTASK_CONNECTIONNOTFOUND DTS_E_FTPTASK_CONNECTIONNOTFOUND

The FTP connection manager "%1" cannot be found.

DTS_E_FTPTASK_CONNECTIONTYPENOTFILE DTS_E_FTPTASK_CONNECTIONTYPENOTFILE DTS_E_FTPTASK_CONNECTIONTYPENOTFILE

The type of connection "%1" is not a file.

DTS_E_FTPTASK_DIRECTORYEXISTS DTS_E_FTPTASK_DIRECTORYEXISTS DTS_E_FTPTASK_DIRECTORYEXISTS

The "%1" already exists.

DTS_E_FTPTASK_ERROR_IN_LOAD_FROM_XML DTS_E_FTPTASK_ERROR_IN_LOAD_FROM_XML DTS_E_FTPTASK_ERROR_IN_LOAD_FROM_XML

An error occurred in LoadFromXML at the tag "%1".

DTS_E_FTPTASK_FILECONNECTIONNOTFOUND DTS_E_FTPTASK_FILECONNECTIONNOTFOUND DTS_E_FTPTASK_FILECONNECTIONNOTFOUND

For the FTP operation "%1", the FILE connection manager "%2" cannot be found.

DTS_E_FTPTASK_FILEDOESNOTEXIST DTS_E_FTPTASK_FILEDOESNOTEXIST DTS_E_FTPTASK_FILEDOESNOTEXIST

The file represented by "%1" does not exist.

DTS_E_FTPTASK_FILEUSAGETYPEERROR DTS_E_FTPTASK_FILEUSAGETYPEERROR DTS_E_FTPTASK_FILEUSAGETYPEERROR

The file usage type of connection "%1" should be "%2" for operation "%3".

DTS_E_FTPTASK_FTPRCVDINVLDDATANODE DTS_E_FTPTASK_FTPRCVDINVLDDATANODE DTS_E_FTPTASK_FTPRCVDINVLDDATANODE

The FTP task received an invalid task data node.

DTS_E_FTPTASK_INVALIDDIRECTORY DTS_E_FTPTASK_INVALIDDIRECTORY DTS_E_FTPTASK_INVALIDDIRECTORY

The directory is not specified in the variable "%1".

DTS_E_FTPTASK_INVALIDPATHONOPERATION DTS_E_FTPTASK_INVALIDPATHONOPERATION DTS_E_FTPTASK_INVALIDPATHONOPERATION

The path is invalid on operation "%1".

DTS_E_FTPTASK_INVALIDREMOTEPATH DTS_E_FTPTASK_INVALIDREMOTEPATH DTS_E_FTPTASK_INVALIDREMOTEPATH

The remote path "%1" doesnot start with "/".

DTS_E_FTPTASK_INVALIDVARIABLEVALUE DTS_E_FTPTASK_INVALIDVARIABLEVALUE DTS_E_FTPTASK_INVALIDVARIABLEVALUE

The variable "%1" doesnot start with "/".

DTS_E_FTPTASK_LOCALPATHEMPTY DTS_E_FTPTASK_LOCALPATHEMPTY DTS_E_FTPTASK_LOCALPATHEMPTY

The local path is empty.

DTS_E_FTPTASK_LOCALVARIABLEISEMPTY DTS_E_FTPTASK_LOCALVARIABLEISEMPTY DTS_E_FTPTASK_LOCALVARIABLEISEMPTY

The variable "%1" is empty.

DTS_E_FTPTASK_LOCALVARIBALEEMPTY DTS_E_FTPTASK_LOCALVARIBALEEMPTY DTS_E_FTPTASK_LOCALVARIBALEEMPTY

The local variable is empty.

DTS_E_FTPTASK_NODIRECTORYPATHINCONMGR DTS_E_FTPTASK_NODIRECTORYPATHINCONMGR DTS_E_FTPTASK_NODIRECTORYPATHINCONMGR

The directory is not specified in the file connection manager "%1".

DTS_E_FTPTASK_NOFILEPATHSINLOCALVAR DTS_E_FTPTASK_NOFILEPATHSINLOCALVAR DTS_E_FTPTASK_NOFILEPATHSINLOCALVAR

The variable "%1" doesn't contain file path(s).

DTS_E_FTPTASK_NOFILESATLOCATION DTS_E_FTPTASK_NOFILESATLOCATION DTS_E_FTPTASK_NOFILESATLOCATION

There are no files at "%1".

DTS_E_FTPTASK_NOFILESFOUND DTS_E_FTPTASK_NOFILESFOUND DTS_E_FTPTASK_NOFILESFOUND

There are no files found in "%1".

DTS_E_FTPTASK_NOFILESINCONNMGR DTS_E_FTPTASK_NOFILESINCONNMGR DTS_E_FTPTASK_NOFILESINCONNMGR

The file "%1" doesnot contain file path(s).

DTS_E_FTPTASK_REMOTEPATHEMPTY DTS_E_FTPTASK_REMOTEPATHEMPTY DTS_E_FTPTASK_REMOTEPATHEMPTY

The remote path is empty.

DTS_E_FTPTASK_REMOTEVARIABLEISEMPTY DTS_E_FTPTASK_REMOTEVARIABLEISEMPTY DTS_E_FTPTASK_REMOTEVARIABLEISEMPTY

The variable "%1" is empty.

DTS_E_FTPTASK_REMOTEVARIBALEEMPTY DTS_E_FTPTASK_REMOTEVARIBALEEMPTY DTS_E_FTPTASK_REMOTEVARIBALEEMPTY

The remote variable is empty.

DTS_E_FTPTASK_SAVE_TO_NULL_XML_ELEMENT DTS_E_FTPTASK_SAVE_TO_NULL_XML_ELEMENT DTS_E_FTPTASK_SAVE_TO_NULL_XML_ELEMENT

The task cannot be saved to a null XML document.

DTS_E_FTPTASK_SYNCOBJFAILED DTS_E_FTPTASK_SYNCOBJFAILED DTS_E_FTPTASK_SYNCOBJFAILED

The synchronization object failed.

DTS_E_FTPTASK_UNABLETOCONNECTTOSERVER DTS_E_FTPTASK_UNABLETOCONNECTTOSERVER DTS_E_FTPTASK_UNABLETOCONNECTTOSERVER

An attempt to connect to FTP server using "%1" failed.

DTS_E_FTPTASK_UNABLETOCREATELOCALDIRECTORY DTS_E_FTPTASK_UNABLETOCREATELOCALDIRECTORY DTS_E_FTPTASK_UNABLETOCREATELOCALDIRECTORY

An attempt to create local directory "%1" failed.

DTS_E_FTPTASK_UNABLETODELETELOCALEFILE DTS_E_FTPTASK_UNABLETODELETELOCALEFILE DTS_E_FTPTASK_UNABLETODELETELOCALEFILE

An attempt to delete local file "%1" failed.

DTS_E_FTPTASK_UNABLETODELETEREMOTEFILES DTS_E_FTPTASK_UNABLETODELETEREMOTEFILES DTS_E_FTPTASK_UNABLETODELETEREMOTEFILES

An attempt to delete remote files using "%1" failed.

DTS_E_FTPTASK_UNABLETOMAKEDIRREMOTE DTS_E_FTPTASK_UNABLETOMAKEDIRREMOTE DTS_E_FTPTASK_UNABLETOMAKEDIRREMOTE

An attempt to create remote directory using "%1" failed.

DTS_E_FTPTASK_UNABLETOOBTAINFILELIST DTS_E_FTPTASK_UNABLETOOBTAINFILELIST DTS_E_FTPTASK_UNABLETOOBTAINFILELIST

An attempt to obtain the file list failed.

DTS_E_FTPTASK_UNABLETORECEIVEFILES DTS_E_FTPTASK_UNABLETORECEIVEFILES DTS_E_FTPTASK_UNABLETORECEIVEFILES

An attempt to receive files using "%1" failed.

DTS_E_FTPTASK_UNABLETOREMOVEDIRREMOTE DTS_E_FTPTASK_UNABLETOREMOVEDIRREMOTE DTS_E_FTPTASK_UNABLETOREMOVEDIRREMOTE

An attempt to remove remote directory using "%1" failed.

DTS_E_FTPTASK_UNABLETOREMOVELOCALDIRECTORY DTS_E_FTPTASK_UNABLETOREMOVELOCALDIRECTORY DTS_E_FTPTASK_UNABLETOREMOVELOCALDIRECTORY

An attempt to remove local directory "%1" failed.

DTS_E_FTPTASK_UNABLETOSENDFILES DTS_E_FTPTASK_UNABLETOSENDFILES DTS_E_FTPTASK_UNABLETOSENDFILES

An attempt to send files using "%1" failed.

DTS_E_FTPTASK_VARIABLENOTASTRING DTS_E_FTPTASK_VARIABLENOTASTRING DTS_E_FTPTASK_VARIABLENOTASTRING

The variable "%1" is not a string.

DTS_E_FTPTASK_VARIABLENOTFOUND DTS_E_FTPTASK_VARIABLENOTFOUND DTS_E_FTPTASK_VARIABLENOTFOUND

The variable "%1" does not exist.

DTS_E_FUNDAMENTALLOADINGERROR DTS_E_FUNDAMENTALLOADINGERROR DTS_E_FUNDAMENTALLOADINGERROR

An attempt to load the package as XML failed because of package does not have a valid XML format. A specific XML parser error will be posted.

DTS_E_FUZZYGROUPINGINTERNALPIPELINEERROR DTS_E_FUZZYGROUPINGINTERNALPIPELINEERROR DTS_E_FUZZYGROUPINGINTERNALPIPELINEERROR

A Fuzzy Grouping transformation pipeline error occurred and returned error code 0x%1!8.8X!: "%2".

DTS_E_FUZZYLOOKUP_REFERENCECACHEFULL DTS_E_FUZZYLOOKUP_REFERENCECACHEFULL DTS_E_FUZZYLOOKUP_REFERENCECACHEFULL

A Fuzzy Lookup was unable to load the entire reference table into main memory as is required when the Exhaustive property is enabled. Either we ran out of system memory or a limit was specified for MaxMemoryUsage which was not sufficient to load the reference table. Either set MaxMemoryUsage to 0 or increase it significantly. Alternatively, disable Exhaustive.

DTS_E_FUZZYLOOKUPREFTABLETOOBIG DTS_E_FUZZYLOOKUPREFTABLETOOBIG DTS_E_FUZZYLOOKUPREFTABLETOOBIG

The reference table specified has too many rows. Fuzzy Lookup only works with reference tables having less than 1 billion rows. Consider using a smaller view of your reference table.

DTS_E_FUZZYLOOKUPUNABLETODELETEEXISTINGMATCHINDEX DTS_E_FUZZYLOOKUPUNABLETODELETEEXISTINGMATCHINDEX DTS_E_FUZZYLOOKUPUNABLETODELETEEXISTINGMATCHINDEX

An error was encountered when trying to delete the existing fuzzy match index named "%1". It is possible that this table was not created by Fuzzy Lookup (or this version of Fuzzy Lookup), it has been damaged, or there is another problem. Try manually deleting the table named "%2" or specify a different name for the MatchIndexName property.

DTS_E_FUZZYLOOKUPUNABLETODETERMINEREFERENCETABLESIZE DTS_E_FUZZYLOOKUPUNABLETODETERMINEREFERENCETABLESIZE DTS_E_FUZZYLOOKUPUNABLETODETERMINEREFERENCETABLESIZE

An attempt to determine the size of the reference table '%1' failed. It is possible that this object is a view and not a table. Fuzzy Lookup does not support views when CopyReferentaceTable=false. Make sure that the table exists and that CopyReferenceTable=true.

DTS_E_GENERICERROR DTS_E_GENERICERROR DTS_E_GENERICERROR

One or more error occurred. There should be more specific errors preceding this one that explains the details of the errors. This message is used as a return value from functions that encounter errors.

DTS_E_GETCATMANAGERFAILED DTS_E_GETCATMANAGERFAILED DTS_E_GETCATMANAGERFAILED

An attempt to get the cat manager failed.

DTS_E_GETCONNECTIONINFOS DTS_E_GETCONNECTIONINFOS DTS_E_GETCONNECTIONINFOS

An attempt to get ConnectionInfos collection failed with error 0x%1!8.8X! "%2". This error occurs when the call to IDTSApplication100::get_ConnectionInfos fails.

DTS_E_GETENUMERATOR DTS_E_GETENUMERATOR DTS_E_GETENUMERATOR

The GetEnumerator method of the ForEach Enumerator has failed with error 0x%1!8.8X! "%2". This occurs when the ForEach Enumerator cannot enumerate.

DTS_E_GETKEYFROMCERTFAILED DTS_E_GETKEYFROMCERTFAILED DTS_E_GETKEYFROMCERTFAILED

An attempt to obtain cryptographic key pair associated with the specified certificate failed with error 0x%1!8.8X! "%2". Verify that you have the key pair for which the certificate was issued.This error usually occurs when trying to sign a document using a certificate for which the person does not have the private key.

DTS_E_GETPACKAGEINFOS DTS_E_GETPACKAGEINFOS DTS_E_GETPACKAGEINFOS

An OLE DB error 0x%1!8.8X! (%2) occurred while enumerating packages. A SQL statement was issued and failed.

DTS_E_GETRTINTERFACEFAILED DTS_E_GETRTINTERFACEFAILED DTS_E_GETRTINTERFACEFAILED

The component "%1" (%2!d!) cannot provide an IDTSRuntimeComponent100 interface.

DTS_E_GETSCHEMATABLEFAILED DTS_E_GETSCHEMATABLEFAILED DTS_E_GETSCHEMATABLEFAILED

The was unable to retrieve column information for the SQL command. The following error occurred:

DTS_E_GETXMLSOURCEFAILED DTS_E_GETXMLSOURCEFAILED DTS_E_GETXMLSOURCEFAILED

An attempt to obtain XML source from XML DOM object failed with error 0x%1!8.8X! "%2". This occurs when IXMLDOMDocument::get_xml fails.

DTS_E_HASEMPTYTASKHOSTS DTS_E_HASEMPTYTASKHOSTS DTS_E_HASEMPTYTASKHOSTS

The package cannot execute because it contains tasks that failed to load.

DTS_E_HASHTABLE_SIZEOVERFLOW DTS_E_HASHTABLE_SIZEOVERFLOW DTS_E_HASHTABLE_SIZEOVERFLOW

The size of the hash table overflowed.

DTS_E_HASSIDEEFFECTSWITHSYNCINP DTS_E_HASSIDEEFFECTSWITHSYNCINP DTS_E_HASSIDEEFFECTSWITHSYNCINP

The "%1" has the HasSideEffects property set to TRUE, but "%1" is synchronous and cannot have side effects. Set the HasSideEffects property to FALSE.

DTS_E_HIDEPROJCONNECTION_NAMECONFLICT DTS_E_HIDEPROJCONNECTION_NAMECONFLICT DTS_E_HIDEPROJCONNECTION_NAMECONFLICT

Hides project connection on name conflict.

DTS_E_ICONVERTTYPEUNAVAILABLE DTS_E_ICONVERTTYPEUNAVAILABLE DTS_E_ICONVERTTYPEUNAVAILABLE

The OLE DB provider used by the OLE DB adapter does not support IConvertType. Set the adapter's ValidateColumnMetaData property to FALSE.

DTS_E_IDNOTINPUTNOROUTPUT DTS_E_IDNOTINPUTNOROUTPUT DTS_E_IDNOTINPUTNOROUTPUT

The ID, %1!lu!, is neither an input ID nor an output ID. The specified ID must be the input ID or the output ID that the external metadata collection is associated with.

DTS_E_IDTSNAMENOTSUPPORTED DTS_E_IDTSNAMENOTSUPPORTED DTS_E_IDTSNAMENOTSUPPORTED

The object does notinherit from IDTSName100.

DTS_E_ILLEGALCUSTOMOUTPUTPROPERTY DTS_E_ILLEGALCUSTOMOUTPUTPROPERTY DTS_E_ILLEGALCUSTOMOUTPUTPROPERTY

The output %1 cannot not have property "%2", but currently has that property assigned.

DTS_E_IMAGEDATATYPENOTSUPPORTED DTS_E_IMAGEDATATYPENOTSUPPORTED DTS_E_IMAGEDATATYPENOTSUPPORTED

The data type for "%1" is DT_IMAGE, which is not supported. Use DT_TEXT or DT_NTEXT instead and convert the data from, or to, DT_IMAGE using the data conversion component.

DTS_E_INCOMPATIBLETRANSACTIONCONTEXT DTS_E_INCOMPATIBLETRANSACTIONCONTEXT DTS_E_INCOMPATIBLETRANSACTIONCONTEXT

The incompatible transaction context was specified for a retained connection. This connection has been established under a different transaction context. Retained connections can be used under exactly one transaction context.

DTS_E_INCOMPLETEDATASOURCECOLUMNFOUND DTS_E_INCOMPLETEDATASOURCECOLUMNFOUND DTS_E_INCOMPLETEDATASOURCECOLUMNFOUND

The complete metadata information for the data source column "%1" is not available. Make sure the column is correctly defined in the data source.

DTS_E_INCORRECT_SQL_SERVER_VERSION DTS_E_INCORRECT_SQL_SERVER_VERSION DTS_E_INCORRECT_SQL_SERVER_VERSION

The DBMS type or version of "%1" is not supported. A connection to Microsoft SQL Server version 8.0 or later is required. This occurs if IDBProperties on the connection did not return a the correct version.

DTS_E_INCORRECTCOLUMNCOUNT DTS_E_INCORRECTCOLUMNCOUNT DTS_E_INCORRECTCOLUMNCOUNT

The number of columns is incorrect.

DTS_E_INCORRECTCOMPONENTVIEWID DTS_E_INCORRECTCOMPONENTVIEWID DTS_E_INCORRECTCOMPONENTVIEWID

The component view ID is incorrect. The component view may be out of synchronization. Try releasing the component view and recreating it.

DTS_E_INCORRECTCONNECTIONMANAGERTYPE DTS_E_INCORRECTCONNECTIONMANAGERTYPE DTS_E_INCORRECTCONNECTIONMANAGERTYPE

The connection manager "%1" is an incorrect type. The type required is "%2". The type available to the component is "%3".

DTS_E_INCORRECTCONNECTIONOBJECTTYPE DTS_E_INCORRECTCONNECTIONOBJECTTYPE DTS_E_INCORRECTCONNECTIONOBJECTTYPE

The connection manager "%1" returned an object of an incorrect type from the AcquireConnection method.

DTS_E_INCORRECTCUSTOMPROPERTYTYPE DTS_E_INCORRECTCUSTOMPROPERTYTYPE DTS_E_INCORRECTCUSTOMPROPERTYTYPE

The custom property "%1" needs to be of type %2.

DTS_E_INCORRECTCUSTOMPROPERTYVALUE DTS_E_INCORRECTCUSTOMPROPERTYVALUE DTS_E_INCORRECTCUSTOMPROPERTYVALUE

The value for custom property "%1" is incorrect.

DTS_E_INCORRECTCUSTOMPROPERTYVALUEFOROBJECT DTS_E_INCORRECTCUSTOMPROPERTYVALUEFOROBJECT DTS_E_INCORRECTCUSTOMPROPERTYVALUEFOROBJECT

The value for custom property "%1" on %2 is incorrect.

DTS_E_INCORRECTEXACTNUMBEROFINPUTS DTS_E_INCORRECTEXACTNUMBEROFINPUTS DTS_E_INCORRECTEXACTNUMBEROFINPUTS

The number of inputs is incorrect. There must be exactly %1!d! inputs.

DTS_E_INCORRECTEXACTNUMBEROFOUTPUTS DTS_E_INCORRECTEXACTNUMBEROFOUTPUTS DTS_E_INCORRECTEXACTNUMBEROFOUTPUTS

The number of outputs is incorrect. There must be exactly %1!d! output(s).

DTS_E_INCORRECTINPUTCACHECOLCOUNT DTS_E_INCORRECTINPUTCACHECOLCOUNT DTS_E_INCORRECTINPUTCACHECOLCOUNT

The number of input columns does not match the number of cache columns.

DTS_E_INCORRECTMINIMUMNUMBEROFOUTPUTS DTS_E_INCORRECTMINIMUMNUMBEROFOUTPUTS DTS_E_INCORRECTMINIMUMNUMBEROFOUTPUTS

The number of outputs is incorrect. There must be at least %1!d! outputs.

DTS_E_INCORRECTPARAMETERMAPPINGFORMAT DTS_E_INCORRECTPARAMETERMAPPINGFORMAT DTS_E_INCORRECTPARAMETERMAPPINGFORMAT

The parameter mapping string is not in the correct format.

DTS_E_INCORRECTSTOCKPROPERTY DTS_E_INCORRECTSTOCKPROPERTY DTS_E_INCORRECTSTOCKPROPERTY

The value for property "%1" on "%2" is not valid.

DTS_E_INCORRECTSTOCKPROPERTYVALUE DTS_E_INCORRECTSTOCKPROPERTYVALUE DTS_E_INCORRECTSTOCKPROPERTYVALUE

The value of the property "%1" is incorrect.

DTS_E_INDIVIDUALCACHEINTERFACESFAILED DTS_E_INDIVIDUALCACHEINTERFACESFAILED DTS_E_INDIVIDUALCACHEINTERFACESFAILED

%1 failed initialization and returned error code 0x%2!8.8X!.

DTS_E_INDIVIDUALCHECKPRODUCTLEVELFAILED DTS_E_INDIVIDUALCHECKPRODUCTLEVELFAILED DTS_E_INDIVIDUALCHECKPRODUCTLEVELFAILED

The %1 failed to perform its required product level check and returned error code 0x%2!8.8X!.

DTS_E_INDIVIDUALCLEANUPFAILED DTS_E_INDIVIDUALCLEANUPFAILED DTS_E_INDIVIDUALCLEANUPFAILED

%1 failed the cleanup phase and returned error code 0x%2!8.8X!.

DTS_E_INDIVIDUALPOSTEXECUTEFAILED DTS_E_INDIVIDUALPOSTEXECUTEFAILED DTS_E_INDIVIDUALPOSTEXECUTEFAILED

%1 failed the post-execute phase and returned error code 0x%2!8.8X!.

DTS_E_INDIVIDUALPREEXECUTEFAILED DTS_E_INDIVIDUALPREEXECUTEFAILED DTS_E_INDIVIDUALPREEXECUTEFAILED

%1 failed the pre-execute phase and returned error code 0x%2!8.8X!.

DTS_E_INDIVIDUALPREPAREFAILED DTS_E_INDIVIDUALPREPAREFAILED DTS_E_INDIVIDUALPREPAREFAILED

%1 failed the prepare phase and returned error code 0x%2!8.8X!.

DTS_E_INDIVIDUALPUTCOMPONENTMETADATAFAILED DTS_E_INDIVIDUALPUTCOMPONENTMETADATAFAILED DTS_E_INDIVIDUALPUTCOMPONENTMETADATAFAILED

The "%1" failed to cache the component metadata object and returned error code 0x%2!8.8X!.

DTS_E_INDIVIDUALPUTEVENTINFOSFAILED DTS_E_INDIVIDUALPUTEVENTINFOSFAILED DTS_E_INDIVIDUALPUTEVENTINFOSFAILED

The EventInfos collection could not be cached by "%1" and returned error code 0x%2!8.8X!.

DTS_E_INDIVIDUALPUTLOGENTRYINFOS DTS_E_INDIVIDUALPUTLOGENTRYINFOS DTS_E_INDIVIDUALPUTLOGENTRYINFOS

The "%1" failed to cache the LogEntryInfos collection and returned error code 0x%2!8.8X!.

DTS_E_INDIVIDUALPUTREFTRACKERFAILED DTS_E_INDIVIDUALPUTREFTRACKERFAILED DTS_E_INDIVIDUALPUTREFTRACKERFAILED

The component "%1" failed to cache the runtime object reference tracker collection and returned error code 0x%2!8.8X!.

DTS_E_INDIVIDUALPUTVARIABLESFAILED DTS_E_INDIVIDUALPUTVARIABLESFAILED DTS_E_INDIVIDUALPUTVARIABLESFAILED

The "%1!s!" cannot cache the Variables collection and returned error code 0x%2!8.8X.

DTS_E_INDIVIDUALRELEASEINTERFACESFAILED DTS_E_INDIVIDUALRELEASEINTERFACESFAILED DTS_E_INDIVIDUALRELEASEINTERFACESFAILED

%1 failed during shut down and returned error code 0x%2!8.8X!. A component failed to release its interfaces.

DTS_E_INDIVIDUALVALIDATIONFAILED DTS_E_INDIVIDUALVALIDATIONFAILED DTS_E_INDIVIDUALVALIDATIONFAILED

%1 failed validation and returned error code 0x%2!8.8X!.

DTS_E_INDIVIDUALVALIDATIONSTATUSFAILED DTS_E_INDIVIDUALVALIDATIONSTATUSFAILED DTS_E_INDIVIDUALVALIDATIONSTATUSFAILED

The "%1" failed validation and returned validation status "%2".

DTS_E_INDUCEDTRANSFORMFAILUREONERROR DTS_E_INDUCEDTRANSFORMFAILUREONERROR DTS_E_INDUCEDTRANSFORMFAILUREONERROR

SSIS Error Code DTS_E_INDUCEDTRANSFORMFAILUREONERROR. The "%1" failed because error code 0x%2!8.8X! occurred, and the error row disposition on "%3" specifies failure on error. An error occurred on the specified object of the specified component. There may be error messages posted before this with more information about the failure.

DTS_E_INDUCEDTRANSFORMFAILUREONTRUNCATION DTS_E_INDUCEDTRANSFORMFAILUREONTRUNCATION DTS_E_INDUCEDTRANSFORMFAILUREONTRUNCATION

The "%1" failed because truncation occurred, and the truncation row disposition on "%2" specifies failure on truncation. A truncation error occurred on the specified object of the specified component.

DTS_E_INITTASKOBJECTFAILED DTS_E_INITTASKOBJECTFAILED DTS_E_INITTASKOBJECTFAILED

Specifies that the initialized task object has failed.

DTS_E_INPUTCOLPROPERTYNOTFOUND DTS_E_INPUTCOLPROPERTYNOTFOUND DTS_E_INPUTCOLPROPERTYNOTFOUND

The "%3" property is required on input column "%1" (%2!d!), but is not found. The missing property should be added.

DTS_E_INPUTCOLUMNBADMAP DTS_E_INPUTCOLUMNBADMAP DTS_E_INPUTCOLUMNBADMAP

The %1 has a mapping that is not valid. An output column with an ID of %2!ld! does not exist on this component.

DTS_E_INPUTCOLUMNNOTFOUND DTS_E_INPUTCOLUMNNOTFOUND DTS_E_INPUTCOLUMNNOTFOUND

The input column lineage ID "%1" referenced by property "%2" on output column "%3" could not be located in the input column collection.

DTS_E_INPUTCOLUMNUSAGETYPENOTREADONLY DTS_E_INPUTCOLUMNUSAGETYPENOTREADONLY DTS_E_INPUTCOLUMNUSAGETYPENOTREADONLY

The input column "%1" must be read-only. The input column has a usage type other than read-only, which is not allowed.

DTS_E_INPUTMUSTBESORTED DTS_E_INPUTMUSTBESORTED DTS_E_INPUTMUSTBESORTED

The input is not sorted. The "%1" must be sorted.

DTS_E_INPUTNOTKNOWN DTS_E_INPUTNOTKNOWN DTS_E_INPUTNOTKNOWN

The thread "%1" received a buffer for input %2!d!, but this thread is not responsible for that input. An error occurred, causing the Data Flow engine scheduler to build a bad execution plan.

DTS_E_INPUTSNOTREADONLY DTS_E_INPUTSNOTREADONLY DTS_E_INPUTSNOTREADONLY

The Usage Type specified for the input columns to this transform cannot be read/write. Change the Usage Type to be read-only.

DTS_E_INPUTWITHOUTPATHS DTS_E_INPUTWITHOUTPATHS DTS_E_INPUTWITHOUTPATHS

A required input object is not connected to a path object.

DTS_E_INSERTERCANTREAD DTS_E_INSERTERCANTREAD DTS_E_INSERTERCANTREAD

The reading from the file "%1" failed with error code 0x%2!8.8X!.

DTS_E_INSERTERCOLUMNALREADYREFERENCED DTS_E_INSERTERCOLUMNALREADYREFERENCED DTS_E_INSERTERCOLUMNALREADYREFERENCED

The %1 references the output column with ID %2!d!, but that column is already referenced by %3.

DTS_E_INSERTERCOLUMNNOTREFERENCED DTS_E_INSERTERCOLUMNNOTREFERENCED DTS_E_INSERTERCOLUMNNOTREFERENCED

The "%1" is not referenced by any input column. Each output column must be referenced by exactly one input column.

DTS_E_INSERTERDATACOLUMNNOTBLOB DTS_E_INSERTERDATACOLUMNNOTBLOB DTS_E_INSERTERDATACOLUMNNOTBLOB

The "%1" references "%2", and that column is not the correct type. It must be DT_TEXT, DT_NTEXT, or DT_IMAGE. A reference points to a column that must be a BLOB.

DTS_E_INSERTEREXPECTBOMINVALIDTYPE DTS_E_INSERTEREXPECTBOMINVALIDTYPE DTS_E_INSERTEREXPECTBOMINVALIDTYPE

The "%1" has the ExpectBOM property set to TRUE for %2, but the column is not NT_NTEXT. The ExpectBOM specifies that the Import Column transformation expects a byte-order mark (BOM). Either set the ExpectBOM property to false or change the output column data type to DT_NTEXT.

DTS_E_INSERTERFILENAMECOLUMNNOTSTRING DTS_E_INSERTERFILENAMECOLUMNNOTSTRING DTS_E_INSERTERFILENAMECOLUMNNOTSTRING

The "%1" should contain a file name, but it is not a String type.

DTS_E_INSERTERINVALIDBOM DTS_E_INSERTERINVALIDBOM DTS_E_INSERTERINVALIDBOM

The byte order mark (BOM) value for the file "%1" is 0x%2!4.4X!, but the expected value is 0x%3!4.4X!. The ExpectBOM property was set for this file, but the BOM value in the file is missing or not valid.

DTS_E_INSERTERINVALIDCOLUMNDATATYPE DTS_E_INSERTERINVALIDCOLUMNDATATYPE DTS_E_INSERTERINVALIDCOLUMNDATATYPE

The %1 has an unsupported datatype. It must be DT_STR or DT_WSTR.

DTS_E_INSERTERINVALIDDATACOLUMNSETTYPE DTS_E_INSERTERINVALIDDATACOLUMNSETTYPE DTS_E_INSERTERINVALIDDATACOLUMNSETTYPE

The data output columns must be DT_TEXT, DT_NTEXT, or DT_IMAGE. The data output column may only be set to a BLOB type.

DTS_E_INSERTERREFERENCEDCOLUMNNOTFOUND DTS_E_INSERTERREFERENCEDCOLUMNNOTFOUND DTS_E_INSERTERREFERENCEDCOLUMNNOTFOUND

The "%1" references output column ID %2!d!, and that column is not found on the output.

DTS_E_INVALIDARRAYVALUE DTS_E_INVALIDARRAYVALUE DTS_E_INVALIDARRAYVALUE

There is an error getting or setting an array value. The type "%1" is not allowed. This occurs when loading an array into a variable.

DTS_E_INVALIDBUFFERTYPE DTS_E_INVALIDBUFFERTYPE DTS_E_INVALIDBUFFERTYPE

The buffer type is not valid. Make sure the Pipeline layout and all components pass validation.

DTS_E_INVALIDBULKINSERTFIRSTROWLASTROWVALUES DTS_E_INVALIDBULKINSERTFIRSTROWLASTROWVALUES DTS_E_INVALIDBULKINSERTFIRSTROWLASTROWVALUES

The value for the property %1 is %2!d!, which must be less than or equal to the value of %3!d! for property %4.

DTS_E_INVALIDBULKINSERTPROPERTYVALUE DTS_E_INVALIDBULKINSERTPROPERTYVALUE DTS_E_INVALIDBULKINSERTPROPERTYVALUE

The value for the property %1 is %2!d!, which is not allowed. The value must be greater than or equal to %3!d!.

DTS_E_INVALIDCACHEFILENAME DTS_E_INVALIDCACHEFILENAME DTS_E_INVALIDCACHEFILENAME

The cache file name is either not provided or is not valid. Provide a valid cache file name.

DTS_E_INVALIDCERTHASHFORMAT DTS_E_INVALIDCERTHASHFORMAT DTS_E_INVALIDCERTHASHFORMAT

The hash value is not a one-dimensional array of bytes (error: %1). This occurs in CPackage::LoadUserCertificateByHash.

DTS_E_INVALIDCHECKPOINT_TRANSACTION DTS_E_INVALIDCHECKPOINT_TRANSACTION DTS_E_INVALIDCHECKPOINT_TRANSACTION

The current package settings are not supported. Please change the SaveCheckpoints property or the TransactionOption property.

DTS_E_INVALIDCHUNKSIZE DTS_E_INVALIDCHUNKSIZE DTS_E_INVALIDCHUNKSIZE

The chunk size is not valid. The ChunkSize property should be in the range of %1!d! to %2!d! (in KB).

DTS_E_INVALIDCODEPAGE DTS_E_INVALIDCODEPAGE DTS_E_INVALIDCODEPAGE

The code page %1!d! specified on output column "%2" (%3!d!) is not valid. Select a different code page for output column "%2".

DTS_E_INVALIDCOMPARISONFLAGS DTS_E_INVALIDCOMPARISONFLAGS DTS_E_INVALIDCOMPARISONFLAGS

The %1 has a ComparisonFlags property that includes extra flags with the value %2!d!.

DTS_E_INVALIDCOMPONENTFILENAME DTS_E_INVALIDCOMPONENTFILENAME DTS_E_INVALIDCOMPONENTFILENAME

The file name for the component with a CLSID of "%1" cannot be acquired. Verify that the component is registered properly or that the CLSID provided is correct.

DTS_E_INVALIDCOMPONENTID DTS_E_INVALIDCOMPONENTID DTS_E_INVALIDCOMPONENTID

The ID for a layout component is not valid.

DTS_E_INVALIDCUSTOMPROPERTYNAME DTS_E_INVALIDCUSTOMPROPERTYNAME DTS_E_INVALIDCUSTOMPROPERTYNAME

A custom property named "%1" is invalid because there is a stock property with that name. A custom property cannot have the same name as a stock property on the same object.

DTS_E_INVALIDDATABASEOBJECTNAME DTS_E_INVALIDDATABASEOBJECTNAME DTS_E_INVALIDDATABASEOBJECTNAME

The database object name "%1" is not valid.

DTS_E_INVALIDDATATYPE DTS_E_INVALIDDATATYPE DTS_E_INVALIDDATATYPE

The %1 had an invalid datatype value (%2!ld!) set.

DTS_E_INVALIDDATATYPEFORERRORCOLUMNS DTS_E_INVALIDDATATYPEFORERRORCOLUMNS DTS_E_INVALIDDATATYPEFORERRORCOLUMNS

The "%1" contains an invalid data type. "%1 " is a special error column, and the only valid data type is DT_I4.

DTS_E_INVALIDENUMERATORINDEX DTS_E_INVALIDENUMERATORINDEX DTS_E_INVALIDENUMERATORINDEX

The enumerator failed to retrieve element at index "%1!d!".

DTS_E_INVALIDERRORDISPOSITION DTS_E_INVALIDERRORDISPOSITION DTS_E_INVALIDERRORDISPOSITION

The %1 has an invalid error or truncation row disposition.

DTS_E_INVALIDEXCLUSIONGROUP DTS_E_INVALIDEXCLUSIONGROUP DTS_E_INVALIDEXCLUSIONGROUP

The "%1" and the "%2" are in the same exclusion group, but they do not have the same synchronous input.

DTS_E_INVALIDFILE DTS_E_INVALIDFILE DTS_E_INVALIDFILE

The file specified in the For Each File enumerator is not valid. Check that the file specified in the For Each File enumerator exists.

DTS_E_INVALIDFILENAMEINCONNECTION DTS_E_INVALIDFILENAMEINCONNECTION DTS_E_INVALIDFILENAMEINCONNECTION

The file name "%1" specified in the connection was not valid.

DTS_E_INVALIDFLATFILECOLUMNTYPE DTS_E_INVALIDFLATFILECOLUMNTYPE DTS_E_INVALIDFLATFILECOLUMNTYPE

The column type for column "%1" is incorrect. It is type "%2". It can only be either "%3" or "%4".

DTS_E_INVALIDFOREACHPROPERTYMAPPING DTS_E_INVALIDFOREACHPROPERTYMAPPING DTS_E_INVALIDFOREACHPROPERTYMAPPING

An invalid property mapping is found on the For Each Loop. This occurs when the ForEach property mapping fails to restore.

DTS_E_INVALIDINDEX DTS_E_INVALIDINDEX DTS_E_INVALIDINDEX

The index is not valid.

DTS_E_INVALIDINPUTCOLUMNCACHE DTS_E_INVALIDINPUTCOLUMNCACHE DTS_E_INVALIDINPUTCOLUMNCACHE

The input column cache is invalid.

DTS_E_INVALIDINPUTCOUNT DTS_E_INVALIDINPUTCOUNT DTS_E_INVALIDINPUTCOUNT

A component has an invalid number of inputs.

DTS_E_INVALIDINPUTLINEAGEID DTS_E_INVALIDINPUTLINEAGEID DTS_E_INVALIDINPUTLINEAGEID

The %1 has lineage ID %2!d! that was not previously used in the Data Flow task.

DTS_E_INVALIDNODE DTS_E_INVALIDNODE DTS_E_INVALIDNODE

The node "%1" is not a valid node. This happens when saving fails.

DTS_E_INVALIDOBJECTID DTS_E_INVALIDOBJECTID DTS_E_INVALIDOBJECTID

The ID for the layout object is not valid.

DTS_E_INVALIDOBJECTNAME DTS_E_INVALIDOBJECTNAME DTS_E_INVALIDOBJECTNAME

The SSIS object name is invalid. More specific errors would have been raised explaining the exact naming problem.

DTS_E_INVALIDORDERCLAUSE DTS_E_INVALIDORDERCLAUSE DTS_E_INVALIDORDERCLAUSE

The order clause is not valid.

DTS_E_INVALIDOUTPUTCOUNT DTS_E_INVALIDOUTPUTCOUNT DTS_E_INVALIDOUTPUTCOUNT

A component has an invalid number of outputs.

DTS_E_INVALIDOUTPUTEXCLUSIONGROUP DTS_E_INVALIDOUTPUTEXCLUSIONGROUP DTS_E_INVALIDOUTPUTEXCLUSIONGROUP

The %1 must be in exclusion group %2!d!. All outputs must be in the specified exclusion group.

DTS_E_INVALIDOUTPUTLINEAGEID DTS_E_INVALIDOUTPUTLINEAGEID DTS_E_INVALIDOUTPUTLINEAGEID

The %1 has lineage ID %2!d!, but should have had %3!d!.

DTS_E_INVALIDPARAMETERVALUE DTS_E_INVALIDPARAMETERVALUE DTS_E_INVALIDPARAMETERVALUE

The parameter value is invalid.

DTS_E_INVALIDPARAMETERVALUETYPE DTS_E_INVALIDPARAMETERVALUETYPE DTS_E_INVALIDPARAMETERVALUETYPE

The parameter value type is invalid.

DTS_E_INVALIDPARENTPACKAGEPATH DTS_E_INVALIDPARENTPACKAGEPATH DTS_E_INVALIDPARENTPACKAGEPATH

The GetPackagePath was called on the ForEachEnumerator but there was no ForEachLoop package path specified.

DTS_E_INVALIDPATHTOPACKAGE DTS_E_INVALIDPATHTOPACKAGE DTS_E_INVALIDPATHTOPACKAGE

The specified package path does not contain a package name. This occurs when the path does not contain at least one backslash or one forward slash.

DTS_E_INVALIDPRECISION DTS_E_INVALIDPRECISION DTS_E_INVALIDPRECISION

The "%1" has a precision that is not valid. The precision must be between %2!ld! and %3!ld!.

DTS_E_INVALIDPROPERTYMAPPING DTS_E_INVALIDPROPERTYMAPPING DTS_E_INVALIDPROPERTYMAPPING

The property mapping is not valid. The mapping is ignored.

DTS_E_INVALIDPROPERTYMAPPINGSFOUND DTS_E_INVALIDPROPERTYMAPPINGSFOUND DTS_E_INVALIDPROPERTYMAPPINGSFOUND

The package failed to restore at least one property mapping.

DTS_E_INVALIDSCALE DTS_E_INVALIDSCALE DTS_E_INVALIDSCALE

The "%1" has a scale that is not valid. The scale must be between %2!ld! and %3!ld!.

DTS_E_INVALIDSCHEME DTS_E_INVALIDSCHEME DTS_E_INVALIDSCHEME

The URL %1 is not valid. This can happen when a scheme other than http or https is specified, or the URL is in an incorrect format. A valid URL format is in the form of http://ServerName:Port/ResourcePath or https://ServerName:Port/ResourcePath.

DTS_E_INVALIDSERVERNAME DTS_E_INVALIDSERVERNAME DTS_E_INVALIDSERVERNAME

The server name specified in the URL %1 cannot be resolved.

DTS_E_INVALIDSIGNATURE DTS_E_INVALIDSIGNATURE DTS_E_INVALIDSIGNATURE

The digital signature is not valid. The contents of the package have been modified.

DTS_E_INVALIDSSISSERVERNAME DTS_E_INVALIDSSISSERVERNAME DTS_E_INVALIDSSISSERVERNAME

The server name "%1" is invalid. The SSIS service does not support multi-instance, use just server name instead of "server name\instance".

DTS_E_INVALIDSTRING DTS_E_INVALIDSTRING DTS_E_INVALIDSTRING

There are invalid characters in string: "%1". This occurs when a string supplied for a property value contains unprintable characters.

DTS_E_INVALIDSTRINGLENGTH DTS_E_INVALIDSTRINGLENGTH DTS_E_INVALIDSTRINGLENGTH

The "%1" has a length that is not valid. The length must be between %2!ld! and %3!ld!.

DTS_E_INVALIDSYNCHRONOUSINPUT DTS_E_INVALIDSYNCHRONOUSINPUT DTS_E_INVALIDSYNCHRONOUSINPUT

The %1 has an invalid synchronous input ID %2!d!.

DTS_E_INVALIDTASKMONIKER DTS_E_INVALIDTASKMONIKER DTS_E_INVALIDTASKMONIKER

A task cannot be created with the name "%1". Verify that the name is correct.

DTS_E_INVALIDTASKMONIKERNOPARAM DTS_E_INVALIDTASKMONIKERNOPARAM DTS_E_INVALIDTASKMONIKERNOPARAM

A task cannot be created from XML. This occurs when the runtime is unable to resolve the name to create a task. Verify that the name is correct.

DTS_E_INVALIDTASKPOINTER DTS_E_INVALIDTASKPOINTER DTS_E_INVALIDTASKPOINTER

The wrappers task pointer is not valid. The wrapper has an invalid pointer to a task.

DTS_E_INVALIDTIMEOUT DTS_E_INVALIDTIMEOUT DTS_E_INVALIDTIMEOUT

The timeout value is not valid. Timeout should be in the range of %1!d! to %2!d! (in seconds).

DTS_E_INVALIDURL DTS_E_INVALIDURL DTS_E_INVALIDURL

The URL specified is not valid. This can happen when the server or proxy URL is null, or in an incorrect format. A valid URL format is in the form of http://ServerName:Port/ResourcePath or https://ServerName:Port/ResourcePath.

DTS_E_INVALIDUSAGETYPEFORCUSTOMPROPERTY DTS_E_INVALIDUSAGETYPEFORCUSTOMPROPERTY DTS_E_INVALIDUSAGETYPEFORCUSTOMPROPERTY

The %1 must be read/write to have custom property "%2". The input or output column has the specified custom property, but is not read/write. Remove the property, or make the column read/write.

DTS_E_INVALIDUSESDISPOSITIONSVALUE DTS_E_INVALIDUSESDISPOSITIONSVALUE DTS_E_INVALIDUSESDISPOSITIONSVALUE

The UsesDispositions property cannot be changed from its initial value. This occurs when the XML is edited and the UsesDispositions value is modified. This value is set by the component when it is added to the package and is not allowed to change.

DTS_E_INVALIDVALUEINARRAY DTS_E_INVALIDVALUEINARRAY DTS_E_INVALIDVALUEINARRAY

A value in array is invalid.

DTS_E_INVALIDVARIABLEVALUE DTS_E_INVALIDVARIABLEVALUE DTS_E_INVALIDVARIABLEVALUE

The variable value assignment is not valid. This error happens when the client or a task assigns a runtime object to a variable value.

DTS_E_INVALIDVARVALUE DTS_E_INVALIDVARVALUE DTS_E_INVALIDVARVALUE

Assigning invalid value or object to variable "%1". This error happens when a value is not appropriate for variables.

DTS_E_INVALIDVERNUMCANTBENEGATIVE DTS_E_INVALIDVERNUMCANTBENEGATIVE DTS_E_INVALIDVERNUMCANTBENEGATIVE

The version number in the package is not valid. The version number is negative.

DTS_E_INVALIDVERSIONNUMBER DTS_E_INVALIDVERSIONNUMBER DTS_E_INVALIDVERSIONNUMBER

The version number in the package is not valid. The version number cannot be greater than current version number.

DTS_E_INVALIDWRAPPEDOBJECT DTS_E_INVALIDWRAPPEDOBJECT DTS_E_INVALIDWRAPPEDOBJECT

An error occurred while accessing an internal object. This could indicate a custom extension built for Integration Services 2005 is being used.

DTS_E_JAGGEDEVENTINFO DTS_E_JAGGEDEVENTINFO DTS_E_JAGGEDEVENTINFO

The lengths of parameter names, types, and descriptions arrays are not equal. The lengths must be equal. This occurs when the lengths of the arrays are mismatched. There should be one entry per parameter in each array.

DTS_E_JOBSTASK_EMPTYSOURCELIST DTS_E_JOBSTASK_EMPTYSOURCELIST DTS_E_JOBSTASK_EMPTYSOURCELIST

There are no Jobs to transfer.

DTS_E_JOBSTASK_FAILEDTOTRANSFERJOBS DTS_E_JOBSTASK_FAILEDTOTRANSFERJOBS DTS_E_JOBSTASK_FAILEDTOTRANSFERJOBS

An attempt to transfer the Job(s) failed.

DTS_E_JOBSTASK_JOBCANTBEFOUND DTS_E_JOBSTASK_JOBCANTBEFOUND DTS_E_JOBSTASK_JOBCANTBEFOUND

The job "%1" cannot be found at source server.

DTS_E_JOBSTASK_JOBEXISTSATDEST DTS_E_JOBSTASK_JOBEXISTSATDEST DTS_E_JOBSTASK_JOBEXISTSATDEST

The job "%1" already exists at destination server.

DTS_E_JOINTYPEDOESNTMATCHETI DTS_E_JOINTYPEDOESNTMATCHETI DTS_E_JOINTYPEDOESNTMATCHETI

The JoinType property specified for input column '%1' differs from the JoinType specified for the corresponding reference table column when the Match Index was initially created. Either rebuild the Match Index with the given JoinType or change the JoinType to match the type used when the Match Index was created.

DTS_E_LAYOUTCANTSETUSAGETYPE DTS_E_LAYOUTCANTSETUSAGETYPE DTS_E_LAYOUTCANTSETUSAGETYPE

At input "%1" (%2!d!), the virtual input column collection does not contain a virtual input column with lineage ID %3!d!.

DTS_E_LOAD_PERSTFORMAT DTS_E_LOAD_PERSTFORMAT DTS_E_LOAD_PERSTFORMAT

An attempt to load Data Flow objects failed. The specified format is not supported.

DTS_E_LOADCHECKPOINT DTS_E_LOADCHECKPOINT DTS_E_LOADCHECKPOINT

The package failed during execution because the checkpoint file cannot be loaded. Further execution of the package requires a checkpoint file. This error usually occurs when the CheckpointUsage property is set to ALWAYS, which specifies that the package always restarts.

DTS_E_LOADFROMSQLSERVER DTS_E_LOADFROMSQLSERVER DTS_E_LOADFROMSQLSERVER

The LoadFromSQLServer method has failed.

DTS_E_LOADFROMSQLSERVER_OLEDB DTS_E_LOADFROMSQLSERVER_OLEDB DTS_E_LOADFROMSQLSERVER_OLEDB

The LoadFromSQLServer method has encountered OLE DB error code 0x%1!8.8X! (%2). The SQL statement that was issued has failed.

DTS_E_LOADFROMXML DTS_E_LOADFROMXML DTS_E_LOADFROMXML

There is an error loading from XML. No further detailed error information can be specified for this problem because no Events object was passed where detailed error information can be stored.

DTS_E_LOADPACKAGEXML DTS_E_LOADPACKAGEXML DTS_E_LOADPACKAGEXML

An attempt to load XML failed due to error 0x%1!8.8X! "%2". This happens when loading a package and the file cannot be opened or loaded correctly into XML document. This can be the result of either providing an incorrect file name to the LoadPackage method or the XML file specified having an incorrect format.

DTS_E_LOADPACKAGEXMLFILE DTS_E_LOADPACKAGEXMLFILE DTS_E_LOADPACKAGEXMLFILE

An attempt to load XML from package file "%1" failed due to error 0x%2!8.8X! "%3". This happens when loading a package and the file cannot be opened or loaded correctly into an XML document. This can be the result of either providing an incorrect file name to the LoadPackage method or the XML file specified having an incorrect format.

DTS_E_LOADWININET DTS_E_LOADWININET DTS_E_LOADWININET

The FTP connection manager needs the following DLL to function: %1.

DTS_E_LOBDATATYPENOTSUPPORTED DTS_E_LOBDATATYPENOTSUPPORTED DTS_E_LOBDATATYPENOTSUPPORTED

The "%1" has a long object data type of DT_TEXT, DT_NTEXT, or DT_IMAGE, which is not supported.

DTS_E_LOBLENGTHLIMITEXCEEDED DTS_E_LOBLENGTHLIMITEXCEEDED DTS_E_LOBLENGTHLIMITEXCEEDED

The system stopped the processing of the character or binary large object (BLOB) data because the 4-GB limit for data size was reached.

DTS_E_LOCALEIDNOTSET DTS_E_LOCALEIDNOTSET DTS_E_LOCALEIDNOTSET

The component locale ID has not been set. Flat file adapters need to have the locale ID on the flat file connection manager set.

DTS_E_LOCALENOTINSTALLED DTS_E_LOCALENOTINSTALLED DTS_E_LOCALENOTINSTALLED

The LocaleID %1!ld! is not installed on this system.

DTS_E_LOCKVARIABLEFORREAD DTS_E_LOCKVARIABLEFORREAD DTS_E_LOCKVARIABLEFORREAD

An attempt to lock variable "%1" for read access failed with error 0x%2!8.8X! "%3".

DTS_E_LOCKVARIABLEFORWRITE DTS_E_LOCKVARIABLEFORWRITE DTS_E_LOCKVARIABLEFORWRITE

An attempt to lock variable "%1" for read/write access failed with error 0x%2!8.8X! "%3".

DTS_E_LOGFAILED DTS_E_LOGFAILED DTS_E_LOGFAILED

The SSIS logging infrastructure failed with error code 0x%1!8.8X!. This error indicates that this logging error is not attributable to a specific log provider.

DTS_E_LOGINFAILURE DTS_E_LOGINFAILURE DTS_E_LOGINFAILURE

The login attempt failed for "%1". This error occurs when the login credentials provided are incorrect. Verify the login credentials.

DTS_E_LOGINSTASK_CANTGETLOGINSNAMELIST DTS_E_LOGINSTASK_CANTGETLOGINSNAMELIST DTS_E_LOGINSTASK_CANTGETLOGINSNAMELIST

The list of "Logins" from source server cannot be acquired.

DTS_E_LOGINSTASK_EMPTYDATABASELIST DTS_E_LOGINSTASK_EMPTYDATABASELIST DTS_E_LOGINSTASK_EMPTYDATABASELIST

The databases list is empty.

DTS_E_LOGINSTASK_EMPTYLIST DTS_E_LOGINSTASK_EMPTYLIST DTS_E_LOGINSTASK_EMPTYLIST

The list of "Logins" to transfer is empty.

DTS_E_LOGINSTASK_ERRORLOGINEXISTS DTS_E_LOGINSTASK_ERRORLOGINEXISTS DTS_E_LOGINSTASK_ERRORLOGINEXISTS

The login "%1" already exists at destination server.

DTS_E_LOGINSTASK_FAILEDTOTRANSFERLOGINS DTS_E_LOGINSTASK_FAILEDTOTRANSFERLOGINS DTS_E_LOGINSTASK_FAILEDTOTRANSFERLOGINS

An attempt to transfer some or all of the logins failed.

DTS_E_LOGINSTASK_LOGINNOTFOUND DTS_E_LOGINSTASK_LOGINNOTFOUND DTS_E_LOGINSTASK_LOGINNOTFOUND

The login "%1" does not exist at source.

DTS_E_LOGPROVIDERFAILED DTS_E_LOGPROVIDERFAILED DTS_E_LOGPROVIDERFAILED

The SSIS logging provider "%1" failed with error code 0x%2!8.8X! (%3). This indicates a logging error attributable to the specified log provider.

DTS_E_LOGPROVIDERVALIDATIONFAILED DTS_E_LOGPROVIDERVALIDATIONFAILED DTS_E_LOGPROVIDERVALIDATIONFAILED

The validation of one or more log providers failed. The package cannot execute. The package does not execute when a log provider fails validation.

DTS_E_LOOKUPEMPTYSQLCOMMAND DTS_E_LOOKUPEMPTYSQLCOMMAND DTS_E_LOOKUPEMPTYSQLCOMMAND

The SQL command has a result of empty lookup.

DTS_E_MANAGEDCOMPONENTSTORENOTFOUND DTS_E_MANAGEDCOMPONENTSTORENOTFOUND DTS_E_MANAGEDCOMPONENTSTORENOTFOUND

An attempt to find the directories containing Tasks and Data Flow Task components failed. Check the integrity of your installation.

DTS_E_MANAGEDERR_BADFORMATSPECIFICATION DTS_E_MANAGEDERR_BADFORMATSPECIFICATION DTS_E_MANAGEDERR_BADFORMATSPECIFICATION

The message string being posted by the managed error infrastructure contains a bad format specification. This is an internal error.

DTS_E_MANAGEDERR_UNSUPPORTEDTYPE DTS_E_MANAGEDERR_UNSUPPORTEDTYPE DTS_E_MANAGEDERR_UNSUPPORTEDTYPE

While formatting a message string using the managed error infrastructure, there was a variant type that does not have formatting support. This is an internal error.

DTS_E_MAPPINGSETUPERROR DTS_E_MAPPINGSETUPERROR DTS_E_MAPPINGSETUPERROR

There was an error setting up the mapping. %1

DTS_E_MCASTOUTPUTCOLUMNS DTS_E_MCASTOUTPUTCOLUMNS DTS_E_MCASTOUTPUTCOLUMNS

The output "%1" (%2!d!) has output columns, but multicast outputs do not declare columns. The package is damaged.

DTS_E_MERGEJOINSORTEDOUTPUTHASNOSORTKEYPOSITIONS DTS_E_MERGEJOINSORTEDOUTPUTHASNOSORTKEYPOSITIONS DTS_E_MERGEJOINSORTEDOUTPUTHASNOSORTKEYPOSITIONS

The "%1" has IsSorted set to TRUE, but the SortKeyPosition on all output columns are zero. Either change the IsSorted to FALSE, or select at least one output column to contain a non-zero SortKeyPosition.

DTS_E_METADATACOLLECTIONNOTUSED DTS_E_METADATACOLLECTIONNOTUSED DTS_E_METADATACOLLECTIONNOTUSED

The external metadata collection on "%1" is marked as not used, so no operations can be performed on it.

DTS_E_METADATAMISMATCHWITHINPUTCOLUMN DTS_E_METADATAMISMATCHWITHINPUTCOLUMN DTS_E_METADATAMISMATCHWITHINPUTCOLUMN

The "%1" metadata does not match the metadata of the input column.

DTS_E_METADATAMISMATCHWITHOUTPUTCOLUMN DTS_E_METADATAMISMATCHWITHOUTPUTCOLUMN DTS_E_METADATAMISMATCHWITHOUTPUTCOLUMN

The metadata for "%1" does not match the metadata for the associated output column.

DTS_E_METADATAREADONLY DTS_E_METADATAREADONLY DTS_E_METADATAREADONLY

The metadata cannot be changed during execution.

DTS_E_MGDSRC_ERROR DTS_E_MGDSRC_ERROR DTS_E_MGDSRC_ERROR

The value was an error.

DTS_E_MGDSRC_OVERFLOW DTS_E_MGDSRC_OVERFLOW DTS_E_MGDSRC_OVERFLOW

The value was too large to fit in the %1.

DTS_E_MGDSRCSTATIC_OVERFLOW DTS_E_MGDSRCSTATIC_OVERFLOW DTS_E_MGDSRCSTATIC_OVERFLOW

The value was too large to fit in the column.

DTS_E_MISMATCHCOMPONENTCONNECTIONMANAGERLOCALEID DTS_E_MISMATCHCOMPONENTCONNECTIONMANAGERLOCALEID DTS_E_MISMATCHCOMPONENTCONNECTIONMANAGERLOCALEID

There is a mismatched locale IDs. The component locale ID (%1!d!) does not match the connection manager locale ID (%2!d!).

DTS_E_MISMATCHCONNECTIONMANAGERCOLUMN DTS_E_MISMATCHCONNECTIONMANAGERCOLUMN DTS_E_MISMATCHCONNECTIONMANAGERCOLUMN

The column "%1" at index %2!d! in the flat file connection manager was not found at index %3!d! in the column collection of the flat file adapter.

DTS_E_MISMATCHPARAMETERVALUE DTS_E_MISMATCHPARAMETERVALUE DTS_E_MISMATCHPARAMETERVALUE

The parameter value was mismatched.

DTS_E_MISSINGCUSTOMPROPERTY DTS_E_MISSINGCUSTOMPROPERTY DTS_E_MISSINGCUSTOMPROPERTY

The "%1" is missing the required property "%2". The object is required to have the specified custom property.

DTS_E_MISSINGOBJECTDATA DTS_E_MISSINGOBJECTDATA DTS_E_MISSINGOBJECTDATA

The ObjectData element is missing in the XML block of a hosted object. This occurs when the XML parser attempts to locate the data element for an object and it cannot be found.

DTS_E_MISSINGSQLCOMMAND DTS_E_MISSINGSQLCOMMAND DTS_E_MISSINGSQLCOMMAND

The SQL command has not been set correctly. Check SQLCommand property.

DTS_E_MORETHANONEERROROUTPUTFOUND DTS_E_MORETHANONEERROROUTPUTFOUND DTS_E_MORETHANONEERROROUTPUTFOUND

More than one error output was found on the component, and there can be only one.

DTS_E_MSGQTASKUTIL_CERT_FAILED_GETTING_DISPLAY_NAME DTS_E_MSGQTASKUTIL_CERT_FAILED_GETTING_DISPLAY_NAME DTS_E_MSGQTASKUTIL_CERT_FAILED_GETTING_DISPLAY_NAME

An error occurred while retrieving the display name of the certificate.

DTS_E_MSGQTASKUTIL_CERT_FAILED_GETTING_FRIENDLY_NAME DTS_E_MSGQTASKUTIL_CERT_FAILED_GETTING_FRIENDLY_NAME DTS_E_MSGQTASKUTIL_CERT_FAILED_GETTING_FRIENDLY_NAME

An error occurred while retrieving the friendly name of the certificate.

DTS_E_MSGQTASKUTIL_CERT_FAILED_GETTING_ISSUER_NAME DTS_E_MSGQTASKUTIL_CERT_FAILED_GETTING_ISSUER_NAME DTS_E_MSGQTASKUTIL_CERT_FAILED_GETTING_ISSUER_NAME

An error occurred while retrieving the issuer name of the certificate.

DTS_E_MSGQTASKUTIL_CERT_OPEN_STORE_FAILED DTS_E_MSGQTASKUTIL_CERT_OPEN_STORE_FAILED DTS_E_MSGQTASKUTIL_CERT_OPEN_STORE_FAILED

The attempt opening the certificate store failed.

DTS_E_MSMQTASK_CONNECTIONTYPENOTMSMQ DTS_E_MSMQTASK_CONNECTIONTYPENOTMSMQ DTS_E_MSMQTASK_CONNECTIONTYPENOTMSMQ

The connection "%1" is not of type MSMQ.

DTS_E_MSMQTASK_CONNMNGRDOESNOTEXIST DTS_E_MSMQTASK_CONNMNGRDOESNOTEXIST DTS_E_MSMQTASK_CONNMNGRDOESNOTEXIST

The connection manager "%1" does not exist.

DTS_E_MSMQTASK_CONNMNGRNULL DTS_E_MSMQTASK_CONNMNGRNULL DTS_E_MSMQTASK_CONNMNGRNULL

The connection manager "%1" is empty.

DTS_E_MSMQTASK_DATA_FILE_NAME_EMPTY DTS_E_MSMQTASK_DATA_FILE_NAME_EMPTY DTS_E_MSMQTASK_DATA_FILE_NAME_EMPTY

The data file name is empty.

DTS_E_MSMQTASK_DATA_FILE_SAVE_FAILED DTS_E_MSMQTASK_DATA_FILE_SAVE_FAILED DTS_E_MSMQTASK_DATA_FILE_SAVE_FAILED

The attempt saving the data file failed.

DTS_E_MSMQTASK_DATA_FILE_SAVE_NAME_EMPTY DTS_E_MSMQTASK_DATA_FILE_SAVE_NAME_EMPTY DTS_E_MSMQTASK_DATA_FILE_SAVE_NAME_EMPTY

The name specified for the data file to save is empty.

DTS_E_MSMQTASK_DATA_FILE_SIZE_ERROR DTS_E_MSMQTASK_DATA_FILE_SIZE_ERROR DTS_E_MSMQTASK_DATA_FILE_SIZE_ERROR

The file size should be less than 4 MB.

DTS_E_MSMQTASK_DATAFILE_ALREADY_EXISTS DTS_E_MSMQTASK_DATAFILE_ALREADY_EXISTS DTS_E_MSMQTASK_DATAFILE_ALREADY_EXISTS

The data file "%1" already exists at the specified location. Cannot overwrite the file as the Overwrite option is set to false.

DTS_E_MSMQTASK_FIPS1402COMPLIANCE DTS_E_MSMQTASK_FIPS1402COMPLIANCE DTS_E_MSMQTASK_FIPS1402COMPLIANCE

The operation requested is not allowed in systems compliant with U.S. FIPS 140-2.

DTS_E_MSMQTASK_INITIALIZATION_WITH_WRONG_XML_ELEMENT DTS_E_MSMQTASK_INITIALIZATION_WITH_WRONG_XML_ELEMENT DTS_E_MSMQTASK_INITIALIZATION_WITH_WRONG_XML_ELEMENT

The task was initialized with the wrong XML element.

DTS_E_MSMQTASK_INVALID_ENCRYPTION_ALGO_WRAPPER DTS_E_MSMQTASK_INVALID_ENCRYPTION_ALGO_WRAPPER DTS_E_MSMQTASK_INVALID_ENCRYPTION_ALGO_WRAPPER

You are trying to set the value of Encryption Algorithm with an invalid object.

DTS_E_MSMQTASK_INVALID_MESSAGE_TYPE DTS_E_MSMQTASK_INVALID_MESSAGE_TYPE DTS_E_MSMQTASK_INVALID_MESSAGE_TYPE

The message type is not valid.

DTS_E_MSMQTASK_INVALID_PROPERTY_VALUE DTS_E_MSMQTASK_INVALID_PROPERTY_VALUE DTS_E_MSMQTASK_INVALID_PROPERTY_VALUE

The property specified is not valid.Verify that the argument type is correct.

DTS_E_MSMQTASK_INVALID_QUEUE_PATH DTS_E_MSMQTASK_INVALID_QUEUE_PATH DTS_E_MSMQTASK_INVALID_QUEUE_PATH

The queue path is not valid.

DTS_E_MSMQTASK_MESSAGE_NON_AUTHENTICATED DTS_E_MSMQTASK_MESSAGE_NON_AUTHENTICATED DTS_E_MSMQTASK_MESSAGE_NON_AUTHENTICATED

The message is not authenticated.

DTS_E_MSMQTASK_NO_CONNECTION DTS_E_MSMQTASK_NO_CONNECTION DTS_E_MSMQTASK_NO_CONNECTION

The MSMQ connection name is not set.

DTS_E_MSMQTASK_NOT_TRANSACTIONAL DTS_E_MSMQTASK_NOT_TRANSACTIONAL DTS_E_MSMQTASK_NOT_TRANSACTIONAL

The message queue task does not support enlisting in distributed transactions.

DTS_E_MSMQTASK_RECEIVE_VARIABLE_EMPTY DTS_E_MSMQTASK_RECEIVE_VARIABLE_EMPTY DTS_E_MSMQTASK_RECEIVE_VARIABLE_EMPTY

The variable to receive variable message is empty.

DTS_E_MSMQTASK_STRING_COMPARE_VALUE_MISSING DTS_E_MSMQTASK_STRING_COMPARE_VALUE_MISSING DTS_E_MSMQTASK_STRING_COMPARE_VALUE_MISSING

The string filter value is empty.

DTS_E_MSMQTASK_STRING_MSG_TO_VARIABLE_NOT_FOUND DTS_E_MSMQTASK_STRING_MSG_TO_VARIABLE_NOT_FOUND DTS_E_MSMQTASK_STRING_MSG_TO_VARIABLE_NOT_FOUND

The specified variable "%1" to receive string message is not found in the package variable collection.

DTS_E_MSMQTASK_TASK_TIMEOUT DTS_E_MSMQTASK_TASK_TIMEOUT DTS_E_MSMQTASK_TASK_TIMEOUT

The message queue timed out. No message has been received.

DTS_E_MSMQTASK_VARIABLE_TO_RECEIVE_STRING_MSG_EMPTY DTS_E_MSMQTASK_VARIABLE_TO_RECEIVE_STRING_MSG_EMPTY DTS_E_MSMQTASK_VARIABLE_TO_RECEIVE_STRING_MSG_EMPTY

The variable to receive string message is empty.

DTS_E_MULTICACHECOLMAPPINGS DTS_E_MULTICACHECOLMAPPINGS DTS_E_MULTICACHECOLMAPPINGS

The cache column, "__", is mapped to more than one column. Remove the duplicate column mappings.

DTS_E_MULTIPLECACHEWRITES DTS_E_MULTIPLECACHEWRITES DTS_E_MULTIPLECACHEWRITES

The cannot write to the cache because has already written to it.

DTS_E_MULTIPLEFILESONRETAINEDCONNECTION DTS_E_MULTIPLEFILESONRETAINEDCONNECTION DTS_E_MULTIPLEFILESONRETAINEDCONNECTION

Multiple file names cannot be specified on a connection when the Retain property is TRUE. Vertical bars were found on the connection string, meaning multiple file names are being specified and, in addition, the Retain property is TRUE.

DTS_E_MULTIPLYMAPPEDOUTCOL DTS_E_MULTIPLYMAPPEDOUTCOL DTS_E_MULTIPLYMAPPEDOUTCOL

The %1 is mapped to an output column that already has a mapping on this input.

DTS_E_MUTEXOWNBYDIFFUSER DTS_E_MUTEXOWNBYDIFFUSER DTS_E_MUTEXOWNBYDIFFUSER

The mutex "__" already exists and is owned by another user.

DTS_E_NAMEALREADYADDED DTS_E_NAMEALREADYADDED DTS_E_NAMEALREADYADDED

The object cannot be added because another object with the same name already exists in the collection. Use a different name to resolve this error.

DTS_E_NAMEALREADYEXISTS DTS_E_NAMEALREADYEXISTS DTS_E_NAMEALREADYEXISTS

The object name cannot be changed from "%1" to "%2" because another object in the collection already uses that name. Use a different name to resolve this error.

DTS_E_NEGATIVEINDEXNOTALLOWED DTS_E_NEGATIVEINDEXNOTALLOWED DTS_E_NEGATIVEINDEXNOTALLOWED

The indexes cannot be negative. This error occurs when a negative value is used as an index to a collection.

DTS_E_NEGATIVESNOTALLOWED DTS_E_NEGATIVESNOTALLOWED DTS_E_NEGATIVESNOTALLOWED

The %1 cannot be assigned a negative value.

DTS_E_NEGATIVEVALUESNOTALLOWED DTS_E_NEGATIVEVALUESNOTALLOWED DTS_E_NEGATIVEVALUESNOTALLOWED

This property cannot be assigned a negative value. This error occurs when a negative value is assigned to a property that can only contain positive values, such as the COUNT property.

DTS_E_NEGATIVEVERSION DTS_E_NEGATIVEVERSION DTS_E_NEGATIVEVERSION

The version number cannot be negative. This error occurs when the VersionMajor, VersionMinor, or VersionBuild property of the package is set to a negative value.

DTS_E_NOBUFFERTYPEONSYNCOUTPUT DTS_E_NOBUFFERTYPEONSYNCOUTPUT DTS_E_NOBUFFERTYPEONSYNCOUTPUT

The %1 is a synchronous output and the buffer type cannot be retrieved for a synchronous output.

DTS_E_NOCANCELEVENT DTS_E_NOCANCELEVENT DTS_E_NOCANCELEVENT

The runtime cannot provide a cancel event because of error 0x%1!8.8X!.

DTS_E_NOCOLUMNADVANCETHROUGHFILE DTS_E_NOCOLUMNADVANCETHROUGHFILE DTS_E_NOCOLUMNADVANCETHROUGHFILE

The column was not specified to allow the component to advance through the file.

DTS_E_NOCOMPONENTATTACHED DTS_E_NOCOMPONENTATTACHED DTS_E_NOCOMPONENTATTACHED

The %1 is not attached to a component. It is required that a component be attached.

DTS_E_NOCONTAININGTYPELIB DTS_E_NOCONTAININGTYPELIB DTS_E_NOCONTAININGTYPELIB

An attempt to retrieve the type library of the object failed. This error occurs when the Properties collection attempts to retrieve the type library for an object through its IDispatch interface.

DTS_E_NOCUSTOMPROPCOL DTS_E_NOCUSTOMPROPCOL DTS_E_NOCUSTOMPROPCOL

An attempt to get custom property collection for Data Flow components failed.

DTS_E_NODATATABLEMATCHROWID DTS_E_NODATATABLEMATCHROWID DTS_E_NODATATABLEMATCHROWID

The %1 contains a RowsetID with a value of %2 that does not reference a data table in the schema.

DTS_E_NODELISTENUM_INVALIDCONNMGRTYPE DTS_E_NODELISTENUM_INVALIDCONNMGRTYPE DTS_E_NODELISTENUM_INVALIDCONNMGRTYPE

The connection manager "%1" is not of type "%2".

DTS_E_NODELISTENUM_INVALIDDATANODE DTS_E_NODELISTENUM_INVALIDDATANODE DTS_E_NODELISTENUM_INVALIDDATANODE

The data node in the nodelist enumerator section is invalid.

DTS_E_NODELISTENUM_NOENUMERATORCREATED DTS_E_NODELISTENUM_NOENUMERATORCREATED DTS_E_NODELISTENUM_NOENUMERATORCREATED

The enumerator cannot be created.

DTS_E_NODELISTENUM_XPATHISEMPTY DTS_E_NODELISTENUM_XPATHISEMPTY DTS_E_NODELISTENUM_XPATHISEMPTY

The "%1" is empty.

DTS_E_NODENOTFOUND DTS_E_NODENOTFOUND DTS_E_NODENOTFOUND

The node cannot be found in custom default persistence. This error occurs if the default saved XML of an extensible object was changed in a way that a saved object is no longer found, or if the extensible object itself changed.

DTS_E_NODISPATCH DTS_E_NODISPATCH DTS_E_NODISPATCH

The object does not implement IDispatch. This error occurs when a property object or properties collection attempts to access an IDispatch interface on an object.

DTS_E_NOERRORDESCFORCOMPONENT DTS_E_NOERRORDESCFORCOMPONENT DTS_E_NOERRORDESCFORCOMPONENT

The component does not supply error code descriptions.

DTS_E_NOEVALEXPRESSION DTS_E_NOEVALEXPRESSION DTS_E_NOEVALEXPRESSION

The evaluation condition expression on the For Loop "%1" is empty. There must be a Boolean evaluation expression in the For Loop.

DTS_E_NOINPUTSOROUTPUTS DTS_E_NOINPUTSOROUTPUTS DTS_E_NOINPUTSOROUTPUTS

A component does not have any inputs or outputs.

DTS_E_NOKEYCOLS DTS_E_NOKEYCOLS DTS_E_NOKEYCOLS

The key columns are not found. The %1 must have at least one column with a SortKeyPosition that is non-zero.

DTS_E_NOMOREBUFFERTYPES DTS_E_NOMOREBUFFERTYPES DTS_E_NOMOREBUFFERTYPES

The buffer manager ran out of memory while trying to extend the table of buffer types. This is caused by an out-of-memory condition.

DTS_E_NOMOREIDS DTS_E_NOMOREIDS DTS_E_NOMOREIDS

The maximum ID has been reached. There are no more IDs available to assign to objects.

DTS_E_NONSORTEDOUTPUTHASSORTKEYPOSITIONS DTS_E_NONSORTEDOUTPUTHASSORTKEYPOSITIONS DTS_E_NONSORTEDOUTPUTHASSORTKEYPOSITIONS

The IsSorted property for "%1" is false, but %2!lu! of its output columns' SortKeyPositions are non-zero.

DTS_E_NONSTRINGCOMPARISONFLAGSNOTZERO DTS_E_NONSTRINGCOMPARISONFLAGSNOTZERO DTS_E_NONSTRINGCOMPARISONFLAGSNOTZERO

The comparison flags for "%1" must be zero because its type is not a string type. ComparisonFlags can only be non-zero for string type columns.

DTS_E_NOOUTPUTCOLUMNFORINPUTCOLUMN DTS_E_NOOUTPUTCOLUMNFORINPUTCOLUMN DTS_E_NOOUTPUTCOLUMNFORINPUTCOLUMN

There is no output column associated with input column "%1" (%2!d!).

DTS_E_NOOUTPUTCOLUMNS DTS_E_NOOUTPUTCOLUMNS DTS_E_NOOUTPUTCOLUMNS

The "%1" contains no output columns. An asynchronous output must contain output columns.

DTS_E_NOROWSETRETURNED DTS_E_NOROWSETRETURNED DTS_E_NOROWSETRETURNED

The result rowset is not associated with the execution of this query. The result is not correctly specified.

DTS_E_NOSCHEMAINFOFOUND DTS_E_NOSCHEMAINFOFOUND DTS_E_NOSCHEMAINFOFOUND

The column information was not returned by the SQL command.

DTS_E_NOSQLPROFILERDLL DTS_E_NOSQLPROFILERDLL DTS_E_NOSQLPROFILERDLL

The log provider for SQL Server Profiler was unable to load pfclnt90.dll. Please check that SQL Server Profiler is installed.

DTS_E_NOTDISPENSED DTS_E_NOTDISPENSED DTS_E_NOTDISPENSED

The Variables collection has not been returned from the VariableDispenser. An operation was attempted that is only allowed on dispensed collections.

DTS_E_NOTENOUGHPARAMETERSPROVIDED DTS_E_NOTENOUGHPARAMETERSPROVIDED DTS_E_NOTENOUGHPARAMETERSPROVIDED

The SQL command requires %1!d! parameters, but the parameter mapping only has %2!d! parameters.

DTS_E_NOTEXECUTING DTS_E_NOTEXECUTING DTS_E_NOTEXECUTING

The Suspend or Resume call failed because the executable is not executing, or is not the top-level executable. This occurs when the client calls Suspend or Resume on an executable that is not currently processing an Execute call.

DTS_E_NOTINITIALIZED DTS_E_NOTINITIALIZED DTS_E_NOTINITIALIZED

An internal object or variable was not initialized. This is an internal product error. This error is returned when a variable should have a valid value but does not.

DTS_E_NOTSUSPENDED DTS_E_NOTSUSPENDED DTS_E_NOTSUSPENDED

The Resume call failed because the package is not suspended. This occurs when the client calls resume, but the package is not suspended.

DTS_E_NTEXTDATATYPENOTSUPPORTEDWITHANSIFILES DTS_E_NTEXTDATATYPENOTSUPPORTEDWITHANSIFILES DTS_E_NTEXTDATATYPENOTSUPPORTEDWITHANSIFILES

The data type for "%1" is DT_NTEXT, which is not supported with ANSI files. Use DT_TEXT instead and convert the data to DT_NTEXT using the data conversion component.

DTS_E_OBJECTIDLOOKUPFAILED DTS_E_OBJECTIDLOOKUPFAILED DTS_E_OBJECTIDLOOKUPFAILED

An attempt to locate an object with ID %1!d! failed because of the error code 0x%2!8.8X!.

DTS_E_OBJECTIDNOTFOUND DTS_E_OBJECTIDNOTFOUND DTS_E_OBJECTIDNOTFOUND

The object with the ID %1!d! does not exist.

DTS_E_OBJECTLINEAGEIDNOTFOUND DTS_E_OBJECTLINEAGEIDNOTFOUND DTS_E_OBJECTLINEAGEIDNOTFOUND

The object with a lineage ID of %1!d! does not exist.

DTS_E_OBJECTNOTINFOREACHLOOP DTS_E_OBJECTNOTINFOREACHLOOP DTS_E_OBJECTNOTINFOREACHLOOP

There is failure when adding an object to a ForEachPropertyMapping that is not a direct child of the ForEachLoop container.

DTS_E_OBJECTNOTINHASHTABLE DTS_E_OBJECTNOTINHASHTABLE DTS_E_OBJECTNOTINHASHTABLE

The object is not in the hash table.

DTS_E_ODBCERROR DTS_E_ODBCERROR DTS_E_ODBCERROR

An ODBC error %1!d! has occurred.

DTS_E_ODBCERRORCONNECT DTS_E_ODBCERRORCONNECT DTS_E_ODBCERRORCONNECT

There was an error trying to establish an Open Database Connectivity (ODBC) connection with the database server.

DTS_E_ODBCERRORDBC DTS_E_ODBCERRORDBC DTS_E_ODBCERRORDBC

There was an error creating an Open Database Connectivity (ODBC) database connection.

DTS_E_ODBCERRORENV DTS_E_ODBCERRORENV DTS_E_ODBCERRORENV

There was an error creating an Open Database Connectivity (ODBC) environment.

DTS_E_ODBCTRANSACTIONENLIST DTS_E_ODBCTRANSACTIONENLIST DTS_E_ODBCTRANSACTIONENLIST

There was an error trying to enlist an ODBC connection in a transaction. The SQLSetConnectAttr failed to set the SQL_ATTR_ENLIST_IN_DTC attribute.

DTS_E_OLEDB_ACENOTFOUND DTS_E_OLEDB_ACENOTFOUND DTS_E_OLEDB_ACENOTFOUND

The ace was not found or not installed.

DTS_E_OLEDB_CREATEACCESSOR DTS_E_OLEDB_CREATEACCESSOR DTS_E_OLEDB_CREATEACCESSOR

An attempt to create an OLE DB accessor failed.

DTS_E_OLEDB_CREATEACCESSOR_UNSUPPORTEDCONVERSION DTS_E_OLEDB_CREATEACCESSOR_UNSUPPORTEDCONVERSION DTS_E_OLEDB_CREATEACCESSOR_UNSUPPORTEDCONVERSION

The conversion is not supported in creating an OLE DB accessor.

DTS_E_OLEDB_EXCEL_NOT_SUPPORTED DTS_E_OLEDB_EXCEL_NOT_SUPPORTED DTS_E_OLEDB_EXCEL_NOT_SUPPORTED

SSIS Error Code DTS_E_OLEDB_EXCEL_NOT_SUPPORTED: The Excel Connection Manager is not supported in the 64-bit version of SSIS, as no OLE DB provider is available.

DTS_E_OLEDB_NOPROVIDER_64BIT_ERROR DTS_E_OLEDB_NOPROVIDER_64BIT_ERROR DTS_E_OLEDB_NOPROVIDER_64BIT_ERROR

SSIS Error Code DTS_E_OLEDB_NOPROVIDER_64BIT_ERROR: The requested OLE DB provider is not registered -- perhaps no 64-bit provider is available. Error code: __.

DTS_E_OLEDB_NOPROVIDER_ERROR DTS_E_OLEDB_NOPROVIDER_ERROR DTS_E_OLEDB_NOPROVIDER_ERROR

SSIS Error Code DTS_E_OLEDB_NOPROVIDER_ERROR: The requested OLE DB provider is not registered. Error code: __.

DTS_E_OLEDB_OLDPROVIDER_ERROR DTS_E_OLEDB_OLDPROVIDER_ERROR DTS_E_OLEDB_OLDPROVIDER_ERROR

You should consider changing the PROVIDER in the connection string to %1 or visit http://www.microsoft.com/downloads to find and install support for %2.

DTS_E_OLEDBDESTINATIONADAPTERSTATIC_CANTCONVERTVALUE DTS_E_OLEDBDESTINATIONADAPTERSTATIC_CANTCONVERTVALUE DTS_E_OLEDBDESTINATIONADAPTERSTATIC_CANTCONVERTVALUE

The data value cannot be converted for reasons other than sign mismatch or data overflow.

DTS_E_OLEDBDESTINATIONADAPTERSTATIC_DATAOVERFLOW DTS_E_OLEDBDESTINATIONADAPTERSTATIC_DATAOVERFLOW DTS_E_OLEDBDESTINATIONADAPTERSTATIC_DATAOVERFLOW

The conversion failed because the data value overflowed the type used by the provider.

DTS_E_OLEDBDESTINATIONADAPTERSTATIC_INTEGRITYVIOLATION DTS_E_OLEDBDESTINATIONADAPTERSTATIC_INTEGRITYVIOLATION DTS_E_OLEDBDESTINATIONADAPTERSTATIC_INTEGRITYVIOLATION

The data value violates integrity constraints.

DTS_E_OLEDBDESTINATIONADAPTERSTATIC_PERMISSIONDENIED DTS_E_OLEDBDESTINATIONADAPTERSTATIC_PERMISSIONDENIED DTS_E_OLEDBDESTINATIONADAPTERSTATIC_PERMISSIONDENIED

The user did not have the correct permissions to write to the column.

DTS_E_OLEDBDESTINATIONADAPTERSTATIC_SCHEMAVIOLATION DTS_E_OLEDBDESTINATIONADAPTERSTATIC_SCHEMAVIOLATION DTS_E_OLEDBDESTINATIONADAPTERSTATIC_SCHEMAVIOLATION

The data value violated the schema constraint.

DTS_E_OLEDBDESTINATIONADAPTERSTATIC_SIGNMISMATCH DTS_E_OLEDBDESTINATIONADAPTERSTATIC_SIGNMISMATCH DTS_E_OLEDBDESTINATIONADAPTERSTATIC_SIGNMISMATCH

The conversion failed because the data value was signed and the type used by the provider was unsigned.

DTS_E_OLEDBDESTINATIONADAPTERSTATIC_TRUNCATED DTS_E_OLEDBDESTINATIONADAPTERSTATIC_TRUNCATED DTS_E_OLEDBDESTINATIONADAPTERSTATIC_TRUNCATED

The data was truncated.

DTS_E_OLEDBDESTINATIONADAPTERSTATIC_UNAVAILABLE DTS_E_OLEDBDESTINATIONADAPTERSTATIC_UNAVAILABLE DTS_E_OLEDBDESTINATIONADAPTERSTATIC_UNAVAILABLE

The status is not available.

DTS_E_OLEDBERROR DTS_E_OLEDBERROR DTS_E_OLEDBERROR

SSIS Error Code DTS_E_OLEDBERROR: An OLE DB error has occurred. Error code: 0x%1!8.8X!.

DTS_E_OLEDBPROVIDERDATATYPECONVERSIONUNSUPPORTED DTS_E_OLEDBPROVIDERDATATYPECONVERSIONUNSUPPORTED DTS_E_OLEDBPROVIDERDATATYPECONVERSIONUNSUPPORTED

The OLE DB provider used by the OLE DB adapter cannot convert between types "%1" and "%2" for "%3".

DTS_E_OLEDBRECORD DTS_E_OLEDBRECORD